BDBM15740 1-(4-fluorophenyl)-4-{[3-(pyridin-3-yl)phenyl]carbonyl}-1H-pyrazol-5-amine::5-Amino-1-(4-fluorophenyl)-4-[3-(pyridin-3-yl)-benzoyl]pyrazole::aminopyrazole 51
SMILES: Nc1c(cnn1-c1ccc(F)cc1)C(=O)c1cccc(c1)-c1cccnc1
InChI Key: InChIKey=MDPZNDLAGKIDFD-UHFFFAOYSA-N
Data: 1 IC50
Activity Spreadsheet -- Enzyme Inhibition Constant Data from BindingDB
Found 1 hit for monomerid = 15740
Trg + Lig
Ki
nM
ΔG°
kcal/mole
IC50
nM
Kd
nM
EC50/IC50
nM
koff
s-1
kon
M-1s-1
pHTemp
°C
Mitogen-activated protein kinase 14
(Homo sapiens (Human))
BDBM15740
(1-(4-fluorophenyl)-4-{[3-(pyridin-3-yl)phenyl]carb...)
Show SMILES Nc1c(cnn1-c1ccc(F)cc1)C(=O)c1cccc(c1)-c1cccnc1
Show InChI InChI=1S/C21H15FN4O/c22-17-6-8-18(9-7-17)26-21(23)19(13-25-26)20(27)15-4-1-3-14(11-15)16-5-2-10-24-12-16/h1-13H,23H2
NCI pathway
Reactome pathway
n/an/a 780n/an/an/an/an/an/a
Roche Palo Alto LLC
Assay Description
Inhibition of human recombinant active p38alpha MAP kinase was tested by measuring the incorporation of 33P from gamma-[33P] ATP into myelin basic pr...
J Med Chem 49: 1562-75 (2006)
Article DOI: 10.1021/jm050736c
BindingDB Entry DOI: 10.7270/Q23776ZN