BDBM157441 US9023865, 282
SMILES: C[C@@H](NC(=O)Nc1cc2[nH]nc(-c3ccc(=O)[nH]c3)c2cn1)c1ccc(F)cc1
InChI Key: InChIKey=MHCSPIWXPQHFEM-ZNCULLJESA-N
Data: 1 IC50
Activity Spreadsheet -- Enzyme Inhibition Constant Data from BindingDB
Found 1 hit for monomerid = 157441
Trg + Lig
Ki
nM
ΔG°
kcal/mole
IC50
nM
Kd
nM
EC50/IC50
nM
koff
s-1
kon
M-1s-1
pHTemp
°C
Mitogen-activated protein kinase 1
(Homo sapiens (Human))
BDBM157441
(US9023865, 282)
Show SMILES C[C@@H](NC(=O)Nc1cc2[nH]nc(-c3ccc(=O)[nH]c3)c2cn1)c1ccc(F)cc1 |r|
Show InChI InChI=1S/C20H15FN6O2/c1-11(12-2-5-14(21)6-3-12)24-20(29)25-17-8-16-15(10-22-17)19(27-26-16)13-4-7-18(28)23-9-13/h2-11H,1H3,(H2,22,24,25,29)/b19-13-/t11-/m1/s1
NCI pathway
Reactome pathway
US Patent
n/an/a 0.304n/an/an/an/an/an/a
Merck Sharp & Dohme Corp.
US Patent
Assay Description
Activated ERK2 activity was determined in an IMAP-FP assay (Molecular Devices). Using this assay format, the potency (IC50) of each compound was dete...
US Patent US9023865 (2015)
BindingDB Entry DOI: 10.7270/Q2PN94CC