BDBM15754 (2S)-3-(3-{[5-amino-1-(4-fluorophenyl)-1H-pyrazol-4-yl]carbonyl}phenoxy)propane-1,2-diol::5-Amino-1-(4-fluorophenyl)-4-[3-{2(S), 3-dihydroxypropoxy}benzoyl]pyrazole::CHEMBL203567::RO3201195::aminopyrazole 63
SMILES: Nc1c(cnn1-c1ccc(F)cc1)C(=O)c1cccc(OC[C@@H](O)CO)c1
InChI Key: InChIKey=IJDQETGUEUJVTB-HNNXBMFYSA-N
Data: 5 IC50  1 Kd
PDB links: 2 PDB IDs match this monomer. 1 PDB ID contains inhibitors having a similarity of 90% to this monomer.
Activity Spreadsheet -- Enzyme Inhibition Constant Data from BindingDB
Found 6 hits for monomerid = 15754
Trg + Lig
Ki
nM
ΔG°
kcal/mole
IC50
nM
Kd
nM
EC50/IC50
nM
koff
s-1
kon
M-1s-1
pHTemp
°C
Mitogen-activated protein kinase 14
(Homo sapiens (Human))
BDBM15754
((2S)-3-(3-{[5-amino-1-(4-fluorophenyl)-1H-pyrazol-...)
Show SMILES Nc1c(cnn1-c1ccc(F)cc1)C(=O)c1cccc(OC[C@@H](O)CO)c1 |r|
Show InChI InChI=1S/C19H18FN3O4/c20-13-4-6-14(7-5-13)23-19(21)17(9-22-23)18(26)12-2-1-3-16(8-12)27-11-15(25)10-24/h1-9,15,24-25H,10-11,21H2/t15-/m0/s1
NCI pathway
Reactome pathway
n/an/a 700n/an/an/an/an/an/a
Roche Palo Alto LLC
Assay Description
Inhibition of human recombinant active p38alpha MAP kinase was tested by measuring the incorporation of 33P from gamma-[33P] ATP into myelin basic pr...
J Med Chem 49: 1562-75 (2006)
Article DOI: 10.1021/jm050736c
BindingDB Entry DOI: 10.7270/Q23776ZN
3D
3D Structure (crystal)
Mitogen-activated protein kinase 9
(Homo sapiens (Human))
BDBM15754
((2S)-3-(3-{[5-amino-1-(4-fluorophenyl)-1H-pyrazol-...)
Show SMILES Nc1c(cnn1-c1ccc(F)cc1)C(=O)c1cccc(OC[C@@H](O)CO)c1 |r|
Show InChI InChI=1S/C19H18FN3O4/c20-13-4-6-14(7-5-13)23-19(21)17(9-22-23)18(26)12-2-1-3-16(8-12)27-11-15(25)10-24/h1-9,15,24-25H,10-11,21H2/t15-/m0/s1
NCI pathway
Reactome pathway
n/an/an/a 5.00E+3n/an/an/an/an/a
Cardiff University
Curated by ChEMBL
Assay Description
Inhibition of JNK2 (unknown origin)
Bioorg Med Chem Lett 18: 3745-8 (2008)
Article DOI: 10.1016/j.bmcl.2008.05.037
BindingDB Entry DOI: 10.7270/Q2BG2NSG
Mitogen-activated protein kinase 14
(Homo sapiens (Human))
BDBM15754
((2S)-3-(3-{[5-amino-1-(4-fluorophenyl)-1H-pyrazol-...)
Show SMILES Nc1c(cnn1-c1ccc(F)cc1)C(=O)c1cccc(OC[C@@H](O)CO)c1 |r|
Show InChI InChI=1S/C19H18FN3O4/c20-13-4-6-14(7-5-13)23-19(21)17(9-22-23)18(26)12-2-1-3-16(8-12)27-11-15(25)10-24/h1-9,15,24-25H,10-11,21H2/t15-/m0/s1
NCI pathway
Reactome pathway
n/an/a 180n/an/an/an/an/an/a
Cardiff University
Curated by ChEMBL
Assay Description
Inhibition of p38alpha in hTERT-immortalized human HCA2 cells assessed as decrease in phosphorylated HSP27 level by ELISA in presence of anisomycin
Bioorg Med Chem Lett 18: 3745-8 (2008)
Article DOI: 10.1016/j.bmcl.2008.05.037
BindingDB Entry DOI: 10.7270/Q2BG2NSG
3D
3D Structure (crystal)
Mitogen-activated protein kinase 14
(Homo sapiens (Human))
BDBM15754
((2S)-3-(3-{[5-amino-1-(4-fluorophenyl)-1H-pyrazol-...)
Show SMILES Nc1c(cnn1-c1ccc(F)cc1)C(=O)c1cccc(OC[C@@H](O)CO)c1 |r|
Show InChI InChI=1S/C19H18FN3O4/c20-13-4-6-14(7-5-13)23-19(21)17(9-22-23)18(26)12-2-1-3-16(8-12)27-11-15(25)10-24/h1-9,15,24-25H,10-11,21H2/t15-/m0/s1
NCI pathway
Reactome pathway
n/an/a 500n/an/an/an/an/an/a
Cardiff University
Curated by ChEMBL
Assay Description
Inhibition of p38alpha (unknown origin)-mediated TNFalpha production in peripheral mononucleocytes
Bioorg Med Chem Lett 18: 3745-8 (2008)
Article DOI: 10.1016/j.bmcl.2008.05.037
BindingDB Entry DOI: 10.7270/Q2BG2NSG
3D
3D Structure (crystal)
Mitogen-activated protein kinase 14
(Homo sapiens (Human))
BDBM15754
((2S)-3-(3-{[5-amino-1-(4-fluorophenyl)-1H-pyrazol-...)
Show SMILES Nc1c(cnn1-c1ccc(F)cc1)C(=O)c1cccc(OC[C@@H](O)CO)c1 |r|
Show InChI InChI=1S/C19H18FN3O4/c20-13-4-6-14(7-5-13)23-19(21)17(9-22-23)18(26)12-2-1-3-16(8-12)27-11-15(25)10-24/h1-9,15,24-25H,10-11,21H2/t15-/m0/s1
NCI pathway
Reactome pathway
n/an/a 400n/an/an/an/an/an/a
Cardiff University
Curated by ChEMBL
Assay Description
Inhibition of p38alpha (unknown origin)-mediated IL1beta production in peripheral mononucleocytes
Bioorg Med Chem Lett 18: 3745-8 (2008)
Article DOI: 10.1016/j.bmcl.2008.05.037
BindingDB Entry DOI: 10.7270/Q2BG2NSG
3D
3D Structure (crystal)
Mitogen-activated protein kinase 14
(Homo sapiens (Human))
BDBM15754
((2S)-3-(3-{[5-amino-1-(4-fluorophenyl)-1H-pyrazol-...)
Show SMILES Nc1c(cnn1-c1ccc(F)cc1)C(=O)c1cccc(OC[C@@H](O)CO)c1 |r|
Show InChI InChI=1S/C19H18FN3O4/c20-13-4-6-14(7-5-13)23-19(21)17(9-22-23)18(26)12-2-1-3-16(8-12)27-11-15(25)10-24/h1-9,15,24-25H,10-11,21H2/t15-/m0/s1
NCI pathway
Reactome pathway
n/an/a 250n/an/an/an/an/an/a
Cardiff University
Curated by ChEMBL
Assay Description
Inhibition of p38alpha-induced TNFalpha production in human THP1 cells
Bioorg Med Chem Lett 18: 3745-8 (2008)
Article DOI: 10.1016/j.bmcl.2008.05.037
BindingDB Entry DOI: 10.7270/Q2BG2NSG
3D
3D Structure (crystal)