null
SMILES: Cn1c(c(-c2ccc(F)cc2)c2ncccc12)-c1ccncc1
InChI Key: InChIKey=SVHIOPOOPNXCLH-UHFFFAOYSA-N
Activity Spreadsheet -- Enzyme Inhibition Constant Data from BindingDB
Found 1 hit for monomerid = 15766
Trg + Lig
Ki
nM
ΔG°
kcal/mole
IC50
nM
Kd
nM
EC50/IC50
nM
koff
s-1
kon
M-1s-1
pHTemp
°C
Mitogen-activated protein kinase 14
(Homo sapiens (Human))
BDBM15766
(3-(4-Fluorophenyl)-1-methyl-2-pyridin-4-yl-1H-pyrr...)
Show SMILES Cn1c(c(-c2ccc(F)cc2)c2ncccc12)-c1ccncc1
Show InChI InChI=1S/C19H14FN3/c1-23-16-3-2-10-22-18(16)17(13-4-6-15(20)7-5-13)19(23)14-8-11-21-12-9-14/h2-12H,1H3
NCI pathway
Reactome pathway
n/an/a 98n/an/an/an/a7.430
Roche Palo Alto LLC
Assay Description
Inhibition of human recombinant active p38alpha MAP kinase was tested by measuring the incorporation of 33P from gamma-[33P] ATP into myelin basic pr...
J Med Chem 46: 4702-13 (2003)
Article DOI: 10.1021/jm0301787
BindingDB Entry DOI: 10.7270/Q2ZG6QHT