null
SMILES: CCC(O)CNc1cc(ccn1)-c1[nH]c2cccnc2c1-c1ccc(F)cc1
InChI Key: InChIKey=XSGWRYUGJCUGNW-UHFFFAOYSA-N
Activity Spreadsheet -- Enzyme Inhibition Constant Data from BindingDB
Found 1 hit for monomerid = 15775
Trg + Lig
Ki
nM
ΔG°
kcal/mole
IC50
nM
Kd
nM
EC50/IC50
nM
koff
s-1
kon
M-1s-1
pHTemp
°C
Mitogen-activated protein kinase 14
(Homo sapiens (Human))
BDBM15775
(1-({4-[3-(4-fluorophenyl)-1H-pyrrolo[3,2-b]pyridin...)
Show SMILES CCC(O)CNc1cc(ccn1)-c1[nH]c2cccnc2c1-c1ccc(F)cc1
Show InChI InChI=1S/C22H21FN4O/c1-2-17(28)13-26-19-12-15(9-11-24-19)21-20(14-5-7-16(23)8-6-14)22-18(27-21)4-3-10-25-22/h3-12,17,27-28H,2,13H2,1H3,(H,24,26)
NCI pathway
Reactome pathway
n/an/a 3n/an/an/an/a7.430
Roche Palo Alto LLC
Assay Description
Inhibition of human recombinant active p38alpha MAP kinase was tested by measuring the incorporation of 33P from gamma-[33P] ATP into myelin basic pr...
J Med Chem 46: 4702-13 (2003)
Article DOI: 10.1021/jm0301787
BindingDB Entry DOI: 10.7270/Q2ZG6QHT