BDBM15785 3-N-{[3-(1H-indol-6-yl)phenyl]methyl}pyridine-2,3-diamine::3-Substituted 2-Aminopyridine 7
SMILES: Nc1ncccc1NCc1cccc(c1)-c1ccc2cc[nH]c2c1
InChI Key: InChIKey=LPQUIIHPUGDHJK-UHFFFAOYSA-N
Data: 1 IC50
PDB links: 1 PDB ID matches this monomer. 1 PDB ID contains this monomer as substructures. 1 PDB ID contains inhibitors having a similarity of 90% to this monomer.
Activity Spreadsheet -- Enzyme Inhibition Constant Data from BindingDB
Found 1 hit for monomerid = 15785
Trg + Lig
Ki
nM
ΔG°
kcal/mole
IC50
nM
Kd
nM
EC50/IC50
nM
koff
s-1
kon
M-1s-1
pHTemp
°C
Beta-secretase 1
(Homo sapiens (Human))
BDBM15785
(3-N-{[3-(1H-indol-6-yl)phenyl]methyl}pyridine-2,3-...)
Show SMILES Nc1ncccc1NCc1cccc(c1)-c1ccc2cc[nH]c2c1
Show InChI InChI=1S/C20H18N4/c21-20-18(5-2-9-23-20)24-13-14-3-1-4-16(11-14)17-7-6-15-8-10-22-19(15)12-17/h1-12,22,24H,13H2,(H2,21,23)
n/an/a 9.10E+3n/an/an/an/a5.022
Astex
Assay Description
Activity of BACE-1 was measured by monitoring the cleavage of its peptide substrate on a Fluoroskan Ascent plate reader with excitation and emission ...
J Med Chem 50: 1124-32 (2007)
Article DOI: 10.1021/jm061197u
BindingDB Entry DOI: 10.7270/Q2TT4P6T
3D
3D Structure (crystal)