BDBM158075 US9024044, 3::US9227949, 3
SMILES: CC(C)(Cc1ccc(s1)C(=O)Oc1ccc(cc1F)C(N)=N)C(=O)NCC(O)=O
InChI Key: InChIKey=FBFZNZYSXBOYCU-UHFFFAOYSA-N
Data: 4 KI
Activity Spreadsheet -- Enzyme Inhibition Constant Data from BindingDB
Found 4 hits for monomerid = 158075
Trg + Lig
Ki
nM
ΔG°
kcal/mole
IC50
nM
Kd
nM
EC50/IC50
nM
koff
s-1
kon
M-1s-1
pHTemp
°C
Enteropeptidase
(Homo sapiens (Human))
BDBM158075
(US9024044, 3 | US9227949, 3)
Show SMILES CC(C)(Cc1ccc(s1)C(=O)Oc1ccc(cc1F)C(N)=N)C(=O)NCC(O)=O
Show InChI InChI=1S/C19H20FN3O5S/c1-19(2,18(27)23-9-15(24)25)8-11-4-6-14(29-11)17(26)28-13-5-3-10(16(21)22)7-12(13)20/h3-7H,8-9H2,1-2H3,(H3,21,22)(H,23,27)(H,24,25)
US Patent
0.290n/an/an/an/an/an/a8.0n/a
AJINOMOTO CO., INC.
US Patent
Assay Description
Using a 96 well plate (#3915, Costar), a test compound (25 uL), 400 mM Tris-HCl buffer (pH 8.0, 25 uL) and 0.5 mg/mL, fluorescence enzyme substrate (...
US Patent US9227949 (2016)
BindingDB Entry DOI: 10.7270/Q2959GBT
Enteropeptidase
(Homo sapiens (Human))
BDBM158075
(US9024044, 3 | US9227949, 3)
Show SMILES CC(C)(Cc1ccc(s1)C(=O)Oc1ccc(cc1F)C(N)=N)C(=O)NCC(O)=O
Show InChI InChI=1S/C19H20FN3O5S/c1-19(2,18(27)23-9-15(24)25)8-11-4-6-14(29-11)17(26)28-13-5-3-10(16(21)22)7-12(13)20/h3-7H,8-9H2,1-2H3,(H3,21,22)(H,23,27)(H,24,25)
US Patent
0.290n/an/an/an/an/an/a8.0n/a
Ajinomoto Co., Inc.
US Patent
Assay Description
Using a 96 well plate (#3915, Costar), a test compound (25 μL), 400 mM Tris-HCl buffer (pH 8.0, 25 μL) and 0.5 mg/mL fluorescence enzyme su...
US Patent US9024044 (2015)
BindingDB Entry DOI: 10.7270/Q2F47MVB
Serine protease 1
(Homo sapiens (Human))
BDBM158075
(US9024044, 3 | US9227949, 3)
Show SMILES CC(C)(Cc1ccc(s1)C(=O)Oc1ccc(cc1F)C(N)=N)C(=O)NCC(O)=O
Show InChI InChI=1S/C19H20FN3O5S/c1-19(2,18(27)23-9-15(24)25)8-11-4-6-14(29-11)17(26)28-13-5-3-10(16(21)22)7-12(13)20/h3-7H,8-9H2,1-2H3,(H3,21,22)(H,23,27)(H,24,25)
Reactome pathway
US Patent
0.420n/an/an/an/an/an/a8.0n/a
AJINOMOTO CO., INC.
US Patent
Assay Description
Using a 96 well plate (#3915, Costar), a test compound (25 uL) was mixed with 20 uM fluorescence enzyme substrate (Boc-Phe-Ser-Arg-AMC, 50 uL) mixed ...
US Patent US9227949 (2016)
BindingDB Entry DOI: 10.7270/Q2959GBT
Serine protease 1
(Homo sapiens (Human))
BDBM158075
(US9024044, 3 | US9227949, 3)
Show SMILES CC(C)(Cc1ccc(s1)C(=O)Oc1ccc(cc1F)C(N)=N)C(=O)NCC(O)=O
Show InChI InChI=1S/C19H20FN3O5S/c1-19(2,18(27)23-9-15(24)25)8-11-4-6-14(29-11)17(26)28-13-5-3-10(16(21)22)7-12(13)20/h3-7H,8-9H2,1-2H3,(H3,21,22)(H,23,27)(H,24,25)
Reactome pathway
US Patent
0.420n/an/an/an/an/an/a8.0n/a
Ajinomoto Co., Inc.
US Patent
Assay Description
Using a 96 well plate (#3915, Costar), a test compound (25 μL) was mixed with 20 μM fluorescence enzyme substrate (Boc-Phe-Ser-Arg-AMC, 50 ...
US Patent US9024044 (2015)
BindingDB Entry DOI: 10.7270/Q2F47MVB