BDBM15814 1:1 mixture of diastereomers::2-[(4-{2-[(4-{[(1S)-1-carboxy-2-methylbutyl]carbamoyl}butyl)carbamoyl]-2-acetamidoethyl}-2-ethylphenyl)amidoformic acid]benzoic acid::oxalyl-aryl-amino benzoic acid-based inhibitor 14
SMILES: CCC(C)[C@H](NC(=O)CCCCNC(=O)C(Cc1ccc(N(C(=O)C(O)=O)c2ccccc2C(O)=O)c(CC)c1)NC(C)=O)C(O)=O
InChI Key: InChIKey=PKLOTZYRQCNNNX-IBQGQNJCSA-N
Data: 2 KI
Activity Spreadsheet -- Enzyme Inhibition Constant Data from BindingDB
Found 2 hits for monomerid = 15814
Trg + Lig
Ki
nM
ΔG°
kcal/mole
IC50
nM
Kd
nM
EC50/IC50
nM
koff
s-1
kon
M-1s-1
pHTemp
°C
Tyrosine-protein phosphatase non-receptor type 2
(Homo sapiens (Human))
BDBM15814
(1:1 mixture of diastereomers | 2-[(4-{2-[(4-{[(1S)...)
Show SMILES CCC(C)[C@H](NC(=O)CCCCNC(=O)C(Cc1ccc(N(C(=O)C(O)=O)c2ccccc2C(O)=O)c(CC)c1)NC(C)=O)C(O)=O |r|
Show InChI InChI=1S/C33H42N4O10/c1-5-19(3)28(32(44)45)36-27(39)13-9-10-16-34-29(40)24(35-20(4)38)18-21-14-15-25(22(6-2)17-21)37(30(41)33(46)47)26-12-8-7-11-23(26)31(42)43/h7-8,11-12,14-15,17,19,24,28H,5-6,9-10,13,16,18H2,1-4H3,(H,34,40)(H,35,38)(H,36,39)(H,42,43)(H,44,45)(H,46,47)/t19?,24?,28-/m0/s1
400n/an/an/an/an/an/an/an/a
Abbott Laboratories
Assay Description
The phosphatase activity resulted in the formation of the colored product p-nitrophenol, which was continuously monitored at 405 nm every 30 s for 15...
Bioorg Med Chem Lett 13: 1887-90 (2003)
Article DOI: 10.1016/S0960-894X(03)00302-0
BindingDB Entry DOI: 10.7270/Q29S1P91
Protein-Tyrosine Phosphatase 1B (PTP1B)
(Homo sapiens (Human))
BDBM15814
(1:1 mixture of diastereomers | 2-[(4-{2-[(4-{[(1S)...)
Show SMILES CCC(C)[C@H](NC(=O)CCCCNC(=O)C(Cc1ccc(N(C(=O)C(O)=O)c2ccccc2C(O)=O)c(CC)c1)NC(C)=O)C(O)=O |r|
Show InChI InChI=1S/C33H42N4O10/c1-5-19(3)28(32(44)45)36-27(39)13-9-10-16-34-29(40)24(35-20(4)38)18-21-14-15-25(22(6-2)17-21)37(30(41)33(46)47)26-12-8-7-11-23(26)31(42)43/h7-8,11-12,14-15,17,19,24,28H,5-6,9-10,13,16,18H2,1-4H3,(H,34,40)(H,35,38)(H,36,39)(H,42,43)(H,44,45)(H,46,47)/t19?,24?,28-/m0/s1
430 -8.59n/an/an/an/an/a7.522
Abbott Laboratories
Assay Description
The phosphatase activity resulted in the formation of the colored product p-nitrophenol, which was continuously monitored at 405 nm every 30 s for 15...
Bioorg Med Chem Lett 13: 1887-90 (2003)
Article DOI: 10.1016/S0960-894X(03)00302-0
BindingDB Entry DOI: 10.7270/Q29S1P91
3D
3D Structure (docked)