BDBM15817 1:1 mixture of diastereomers::2-[(4-{2-[(4-{[(1S)-1-carboxypentyl]carbamoyl}butyl)carbamoyl]-2-acetamidoethyl}-2-ethylphenyl)amidoformic acid]benzoic acid::oxalyl-aryl-amino benzoic acid-based inhibitor 17
SMILES: CCCC[C@H](NC(=O)CCCCNC(=O)C(Cc1ccc(N(C(=O)C(O)=O)c2ccccc2C(O)=O)c(CC)c1)NC(C)=O)C(O)=O
InChI Key: InChIKey=RHLVQCYCENTGQZ-SKCDSABHSA-N
Data: 3 KI
Activity Spreadsheet -- Enzyme Inhibition Constant Data from BindingDB
Found 3 hits for monomerid = 15817
Trg + Lig
Ki
nM
ΔG°
kcal/mole
IC50
nM
Kd
nM
EC50/IC50
nM
koff
s-1
kon
M-1s-1
pHTemp
°C
Protein-tyrosine phosphatase 1B
(Homo sapiens (Human))
BDBM15817
(1:1 mixture of diastereomers | 2-[(4-{2-[(4-{[(1S)...)
Show SMILES CCCC[C@H](NC(=O)CCCCNC(=O)C(Cc1ccc(N(C(=O)C(O)=O)c2ccccc2C(O)=O)c(CC)c1)NC(C)=O)C(O)=O |r|
Show InChI InChI=1S/C33H42N4O10/c1-4-6-12-24(32(44)45)36-28(39)14-9-10-17-34-29(40)25(35-20(3)38)19-21-15-16-26(22(5-2)18-21)37(30(41)33(46)47)27-13-8-7-11-23(27)31(42)43/h7-8,11,13,15-16,18,24-25H,4-6,9-10,12,14,17,19H2,1-3H3,(H,34,40)(H,35,38)(H,36,39)(H,42,43)(H,44,45)(H,46,47)/t24-,25?/m0/s1
NCI pathway
Reactome pathway
100n/an/an/an/an/an/an/an/a
Abbott Laboratories
Curated by ChEMBL
Assay Description
Inhibition of PTP1B
J Med Chem 52: 3159-65 (2009)
Article DOI: 10.1021/jm801444x
BindingDB Entry DOI: 10.7270/Q2FF3TM8
3D
3D Structure (docked)
Protein-Tyrosine Phosphatase 1B (PTP1B)
(Homo sapiens (Human))
BDBM15817
(1:1 mixture of diastereomers | 2-[(4-{2-[(4-{[(1S)...)
Show SMILES CCCC[C@H](NC(=O)CCCCNC(=O)C(Cc1ccc(N(C(=O)C(O)=O)c2ccccc2C(O)=O)c(CC)c1)NC(C)=O)C(O)=O |r|
Show InChI InChI=1S/C33H42N4O10/c1-4-6-12-24(32(44)45)36-28(39)14-9-10-17-34-29(40)25(35-20(3)38)19-21-15-16-26(22(5-2)18-21)37(30(41)33(46)47)27-13-8-7-11-23(27)31(42)43/h7-8,11,13,15-16,18,24-25H,4-6,9-10,12,14,17,19H2,1-3H3,(H,34,40)(H,35,38)(H,36,39)(H,42,43)(H,44,45)(H,46,47)/t24-,25?/m0/s1
120 -9.34n/an/an/an/an/a7.522
Abbott Laboratories
Assay Description
The phosphatase activity resulted in the formation of the colored product p-nitrophenol, which was continuously monitored at 405 nm every 30 s for 15...
Bioorg Med Chem Lett 13: 1887-90 (2003)
Article DOI: 10.1016/S0960-894X(03)00302-0
BindingDB Entry DOI: 10.7270/Q29S1P91
3D
3D Structure (docked)
Tyrosine-protein phosphatase non-receptor type 2
(Homo sapiens (Human))
BDBM15817
(1:1 mixture of diastereomers | 2-[(4-{2-[(4-{[(1S)...)
Show SMILES CCCC[C@H](NC(=O)CCCCNC(=O)C(Cc1ccc(N(C(=O)C(O)=O)c2ccccc2C(O)=O)c(CC)c1)NC(C)=O)C(O)=O |r|
Show InChI InChI=1S/C33H42N4O10/c1-4-6-12-24(32(44)45)36-28(39)14-9-10-17-34-29(40)25(35-20(3)38)19-21-15-16-26(22(5-2)18-21)37(30(41)33(46)47)27-13-8-7-11-23(27)31(42)43/h7-8,11,13,15-16,18,24-25H,4-6,9-10,12,14,17,19H2,1-3H3,(H,34,40)(H,35,38)(H,36,39)(H,42,43)(H,44,45)(H,46,47)/t24-,25?/m0/s1
240n/an/an/an/an/an/an/an/a
Abbott Laboratories
Assay Description
The phosphatase activity resulted in the formation of the colored product p-nitrophenol, which was continuously monitored at 405 nm every 30 s for 15...
Bioorg Med Chem Lett 13: 1887-90 (2003)
Article DOI: 10.1016/S0960-894X(03)00302-0
BindingDB Entry DOI: 10.7270/Q29S1P91