null
SMILES: Clc1ccc(s1)-c1cc(Cn2c(cc3ccccc23)C(=O)NC2CCN(CC2)C2CCCC2)no1
InChI Key: InChIKey=HRXHFNVTHGOHAS-UHFFFAOYSA-N
Activity Spreadsheet -- Enzyme Inhibition Constant Data from BindingDB
Found 1 hit for monomerid = 15829
Trg + Lig
Ki
nM
ΔG°
kcal/mole
IC50
nM
Kd
nM
EC50/IC50
nM
koff
s-1
kon
M-1s-1
pHTemp
°C
Coagulation factor X
(Homo sapiens (Human))
BDBM15829
(1-{[5-(5-chlorothiophen-2-yl)-1,2-oxazol-3-yl]meth...)
Show SMILES Clc1ccc(s1)-c1cc(Cn2c(cc3ccccc23)C(=O)NC2CCN(CC2)C2CCCC2)no1
Show InChI InChI=1S/C27H29ClN4O2S/c28-26-10-9-25(35-26)24-16-20(30-34-24)17-32-22-8-4-1-5-18(22)15-23(32)27(33)29-19-11-13-31(14-12-19)21-6-2-3-7-21/h1,4-5,8-10,15-16,19,21H,2-3,6-7,11-14,17H2,(H,29,33)
Reactome pathway
71 -9.75n/an/an/an/an/a7.825
Aventis Pharma Deutschland GmbH
Assay Description
The inhibitory effect of test compound for human fXa was determined by using the chromogenic substrates S-2765. The hydrolysis rates of chromogenic s...
Bioorg Med Chem Lett 14: 4197-201 (2004)
Article DOI: 10.1016/j.bmcl.2004.06.019
BindingDB Entry DOI: 10.7270/Q2610XKM