BDBM15866 1-{[(3-chlorophenyl)carbamoyl]methyl}-N-[1-(propan-2-yl)piperidin-4-yl]-1H-indole-2-carboxamide::2-carboxyindole 28
SMILES: CC(C)N1CCC(CC1)NC(=O)c1cc2ccccc2n1CC(=O)Nc1cccc(Cl)c1
InChI Key: InChIKey=QIOZPGMOYGXSIH-UHFFFAOYSA-N
Data: 1 KI
Activity Spreadsheet -- Enzyme Inhibition Constant Data from BindingDB
Found 1 hit for monomerid = 15866
Trg + Lig
Ki
nM
ΔG°
kcal/mole
IC50
nM
Kd
nM
EC50/IC50
nM
koff
s-1
kon
M-1s-1
pHTemp
°C
Coagulation factor X
(Homo sapiens (Human))
BDBM15866
(1-{[(3-chlorophenyl)carbamoyl]methyl}-N-[1-(propan...)
Show SMILES CC(C)N1CCC(CC1)NC(=O)c1cc2ccccc2n1CC(=O)Nc1cccc(Cl)c1
Show InChI InChI=1S/C25H29ClN4O2/c1-17(2)29-12-10-20(11-13-29)28-25(32)23-14-18-6-3-4-9-22(18)30(23)16-24(31)27-21-8-5-7-19(26)15-21/h3-9,14-15,17,20H,10-13,16H2,1-2H3,(H,27,31)(H,28,32)
Reactome pathway
287 -8.92n/an/an/an/an/a7.825
Aventis Pharma Deutschland GmbH
Assay Description
The inhibitory effect of test compound for human fXa was determined by using the chromogenic substrates S-2765. The hydrolysis rates of chromogenic s...
Bioorg Med Chem Lett 14: 4191-5 (2004)
Article DOI: 10.1016/j.bmcl.2004.06.020
BindingDB Entry DOI: 10.7270/Q22805WQ