BDBM159087 US9034866, 562
SMILES: C[C@@H]1COc2ccc(cc2-c2nc(sc12)C(N)=O)C#C[C@]1(O)CCNC1=O
InChI Key: InChIKey=YLVJLYJWERBUMY-DGIBIBHMSA-N
Data: 2 KI
Activity Spreadsheet -- Enzyme Inhibition Constant Data from BindingDB
Found 2 hits for monomerid = 159087
Trg + Lig
Ki
nM
ΔG°
kcal/mole
IC50
nM
Kd
nM
EC50/IC50
nM
koff
s-1
kon
M-1s-1
pHTemp
°C
Mitogen-activated protein kinase kinase kinase 14
(Homo sapiens (Human))
BDBM159087
(US9034866, 562)
Show SMILES C[C@@H]1COc2ccc(cc2-c2nc(sc12)C(N)=O)C#C[C@]1(O)CCNC1=O |r|
Show InChI InChI=1S/C19H17N3O4S/c1-10-9-26-13-3-2-11(4-5-19(25)6-7-21-18(19)24)8-12(13)14-15(10)27-17(22-14)16(20)23/h2-3,8,10,25H,6-7,9H2,1H3,(H2,20,23)(H,21,24)/t10-,19+/m1/s1
US Patent
0.100n/an/an/an/an/an/a7.2n/a
Genentech, Inc.
US Patent
Assay Description
The ability of the nuclear factor-kappa B (NF-kB)-inducing kinase (NIK) to catalyze the hydrolysis of adenosine-5'-triphosphate (ATP) was monitored u...
US Patent US9034866 (2015)
BindingDB Entry DOI: 10.7270/Q2GX49B0
Mitogen-activated protein kinase kinase kinase 14
(Homo sapiens (Human))
BDBM159087
(US9034866, 562)
Show SMILES C[C@@H]1COc2ccc(cc2-c2nc(sc12)C(N)=O)C#C[C@]1(O)CCNC1=O |r|
Show InChI InChI=1S/C19H17N3O4S/c1-10-9-26-13-3-2-11(4-5-19(25)6-7-21-18(19)24)8-12(13)14-15(10)27-17(22-14)16(20)23/h2-3,8,10,25H,6-7,9H2,1H3,(H2,20,23)(H,21,24)/t10-,19+/m1/s1
US Patent
0.890n/an/an/an/an/an/a7.2n/a
Genentech, Inc.
US Patent
Assay Description
The ability of the nuclear factor-kappa B (NF-kB)-inducing kinase (NIK) to catalyze the hydrolysis of adenosine-5'-triphosphate (ATP) was monitored u...
US Patent US9034866 (2015)
BindingDB Entry DOI: 10.7270/Q2GX49B0