null
SMILES: Cc1ccnc(NC(=O)c2ccc(cc2C(O)=O)C(F)(F)F)n1
InChI Key: InChIKey=KFZYQRJIYWGSCY-UHFFFAOYSA-N
Activity Spreadsheet -- Enzyme Inhibition Constant Data from BindingDB
Found 3 hits for monomerid = 159139
Trg + Lig
Ki
nM
ΔG°
kcal/mole
IC50
nM
Kd
nM
EC50/IC50
nM
koff
s-1
kon
M-1s-1
pHTemp
°C
Sortilin
(Homo sapiens (Human))
BDBM159139
(US10195186, Example 17 | US9682967, 17)
Show SMILES Cc1ccnc(NC(=O)c2ccc(cc2C(O)=O)C(F)(F)F)n1
Show InChI InChI=1S/C14H10F3N3O3/c1-7-4-5-18-13(19-7)20-11(21)9-3-2-8(14(15,16)17)6-10(9)12(22)23/h2-6H,1H3,(H,22,23)(H,18,19,20,21)
NCI pathway
Reactome pathway
US Patent
343n/a 360n/an/an/an/a7.4n/a
H. Lundbeck A/S
US Patent
Assay Description
The Sortilin assay was performed in total volume of 40 ul in 50 mM HEPES pH 7.4 assay buffer containing 100 mM NaCl, 2.0 mM CaCl2, 0.1% BSA and 0.1% ...
US Patent US9682967 (2017)
BindingDB Entry DOI: 10.7270/Q22805SC
Sortilin
(Homo sapiens (Human))
BDBM159139
(US10195186, Example 17 | US9682967, 17)
Show SMILES Cc1ccnc(NC(=O)c2ccc(cc2C(O)=O)C(F)(F)F)n1
Show InChI InChI=1S/C14H10F3N3O3/c1-7-4-5-18-13(19-7)20-11(21)9-3-2-8(14(15,16)17)6-10(9)12(22)23/h2-6H,1H3,(H,22,23)(H,18,19,20,21)
NCI pathway
Reactome pathway
US Patent
343n/an/an/an/an/an/an/an/a
H. Lundbeck A/S
US Patent
Assay Description
The Sortilin assay was performed in total volume of 40 ul in 50 mM HEPES pH 7.4 assay buffer containing 100 mM NaCl, 2.0 mM CaCl2, 0.1% BSA and 0.1% ...
US Patent US10195186 (2019)
BindingDB Entry DOI: 10.7270/Q2474CZW
Sortilin
(Homo sapiens (Human))
BDBM159139
(US10195186, Example 17 | US9682967, 17)
Show SMILES Cc1ccnc(NC(=O)c2ccc(cc2C(O)=O)C(F)(F)F)n1
Show InChI InChI=1S/C14H10F3N3O3/c1-7-4-5-18-13(19-7)20-11(21)9-3-2-8(14(15,16)17)6-10(9)12(22)23/h2-6H,1H3,(H,22,23)(H,18,19,20,21)
NCI pathway
Reactome pathway
US Patent
n/an/a 360n/an/an/an/an/an/a
H. Lundbeck A/S
US Patent
Assay Description
The Sortilin assay was performed in total volume of 40 ul in 50 mM HEPES pH 7.4 assay buffer containing 100 mM NaCl, 2.0 mM CaCl2, 0.1% BSA and 0.1% ...
US Patent US10195186 (2019)
BindingDB Entry DOI: 10.7270/Q2474CZW