BDBM159164 US9034866, 641
SMILES: CN1CC[C@@](O)(C#Cc2cc3-c4nc(sc4C(F)(F)COc3cc2F)C(N)=O)C1=O
InChI Key: InChIKey=GWAPPQLOCMANSK-SFHVURJKSA-N
Data: 1 KI
Activity Spreadsheet -- Enzyme Inhibition Constant Data from BindingDB
Found 1 hit for monomerid = 159164
Trg + Lig
Ki
nM
ΔG°
kcal/mole
IC50
nM
Kd
nM
EC50/IC50
nM
koff
s-1
kon
M-1s-1
pHTemp
°C
Mitogen-activated protein kinase kinase kinase 14
(Homo sapiens (Human))
BDBM159164
(US9034866, 641)
Show SMILES CN1CC[C@@](O)(C#Cc2cc3-c4nc(sc4C(F)(F)COc3cc2F)C(N)=O)C1=O |r|
Show InChI InChI=1S/C19H14F3N3O4S/c1-25-5-4-18(28,17(25)27)3-2-9-6-10-12(7-11(9)20)29-8-19(21,22)14-13(10)24-16(30-14)15(23)26/h6-7,28H,4-5,8H2,1H3,(H2,23,26)/t18-/m0/s1
US Patent
0.200n/an/an/an/an/an/a7.2n/a
Genentech, Inc.
US Patent
Assay Description
The ability of the nuclear factor-kappa B (NF-kB)-inducing kinase (NIK) to catalyze the hydrolysis of adenosine-5'-triphosphate (ATP) was monitored u...
US Patent US9034866 (2015)
BindingDB Entry DOI: 10.7270/Q2GX49B0