BDBM159171 US9034866, 648
SMILES: CN1CC[C@@](O)(C#Cc2ccc3OC[C@@H](O)c4sc(nc4-c3c2)C(N)=O)C1=O
InChI Key: InChIKey=LCQFWABXVYPPQW-BLVKFPJESA-N
Data: 2 KI
Activity Spreadsheet -- Enzyme Inhibition Constant Data from BindingDB
Found 2 hits for monomerid = 159171
Trg + Lig
Ki
nM
ΔG°
kcal/mole
IC50
nM
Kd
nM
EC50/IC50
nM
koff
s-1
kon
M-1s-1
pHTemp
°C
Mitogen-activated protein kinase kinase kinase 14
(Homo sapiens (Human))
BDBM159171
(US9034866, 648)
Show SMILES CN1CC[C@@](O)(C#Cc2ccc3OC[C@@H](O)c4sc(nc4-c3c2)C(N)=O)C1=O |r|
Show InChI InChI=1S/C19H17N3O5S/c1-22-7-6-19(26,18(22)25)5-4-10-2-3-13-11(8-10)14-15(12(23)9-27-13)28-17(21-14)16(20)24/h2-3,8,12,23,26H,6-7,9H2,1H3,(H2,20,24)/t12-,19+/m1/s1
US Patent
0.400n/an/an/an/an/an/a7.2n/a
Genentech, Inc.
US Patent
Assay Description
The ability of the nuclear factor-kappa B (NF-kB)-inducing kinase (NIK) to catalyze the hydrolysis of adenosine-5'-triphosphate (ATP) was monitored u...
US Patent US9034866 (2015)
BindingDB Entry DOI: 10.7270/Q2GX49B0
Mitogen-activated protein kinase kinase kinase 14
(Homo sapiens (Human))
BDBM159171
(US9034866, 648)
Show SMILES CN1CC[C@@](O)(C#Cc2ccc3OC[C@@H](O)c4sc(nc4-c3c2)C(N)=O)C1=O |r|
Show InChI InChI=1S/C19H17N3O5S/c1-22-7-6-19(26,18(22)25)5-4-10-2-3-13-11(8-10)14-15(12(23)9-27-13)28-17(21-14)16(20)24/h2-3,8,12,23,26H,6-7,9H2,1H3,(H2,20,24)/t12-,19+/m1/s1
US Patent
0.600n/an/an/an/an/an/a7.2n/a
Genentech, Inc.
US Patent
Assay Description
The ability of the nuclear factor-kappa B (NF-kB)-inducing kinase (NIK) to catalyze the hydrolysis of adenosine-5'-triphosphate (ATP) was monitored u...
US Patent US9034866 (2015)
BindingDB Entry DOI: 10.7270/Q2GX49B0