BDBM159244 US9034874, 1.1
SMILES: O=C(OC1CCN(CC1)c1ccc(=O)[nH]n1)N1CCN(CC1)C1CCC1
InChI Key: InChIKey=AKBDWSBBADJJLP-UHFFFAOYSA-N
Data: 2 KI
Activity Spreadsheet -- Enzyme Inhibition Constant Data from BindingDB
Found 2 hits for monomerid = 159244
Trg + Lig
Ki
nM
ΔG°
kcal/mole
IC50
nM
Kd
nM
EC50/IC50
nM
koff
s-1
kon
M-1s-1
pHTemp
°C
Histamine H3 receptor
(Homo sapiens (Human))
BDBM159244
(US9034874, 1.1)
Show SMILES O=C(OC1CCN(CC1)c1ccc(=O)[nH]n1)N1CCN(CC1)C1CCC1
Show InChI InChI=1S/C18H27N5O3/c24-17-5-4-16(19-20-17)22-8-6-15(7-9-22)26-18(25)23-12-10-21(11-13-23)14-2-1-3-14/h4-5,14-15H,1-3,6-13H2,(H,20,24)
Reactome pathway
US Patent
1.30n/an/an/an/an/an/an/an/a
NOVARTIS AG
US Patent
Assay Description
The potency of compounds of the invention as H3 receptor antagonists can be assessed by measuring the blockade of (R)-alpha-methylhistamine-mediated ...
US Patent US9034874 (2015)
BindingDB Entry DOI: 10.7270/Q2C82819
Histamine H3 receptor
(Homo sapiens (Human))
BDBM159244
(US9034874, 1.1)
Show SMILES O=C(OC1CCN(CC1)c1ccc(=O)[nH]n1)N1CCN(CC1)C1CCC1
Show InChI InChI=1S/C18H27N5O3/c24-17-5-4-16(19-20-17)22-8-6-15(7-9-22)26-18(25)23-12-10-21(11-13-23)14-2-1-3-14/h4-5,14-15H,1-3,6-13H2,(H,20,24)
Reactome pathway
US Patent
26n/an/an/an/an/an/a7.5n/a
NOVARTIS AG
US Patent
Assay Description
The affinity of compounds of the invention to the H3 receptor can be assessed by measuring displacement of binding of the radioligand [3H]-N-alpha -M...
US Patent US9034874 (2015)
BindingDB Entry DOI: 10.7270/Q2C82819