null
SMILES: CC(C)N1CCN(CC1)C(=O)OC1CCN(CC1)c1cc[nH]c(=O)c1
InChI Key: InChIKey=JEOAGENLLSBVFS-UHFFFAOYSA-N
Activity Spreadsheet -- Enzyme Inhibition Constant Data from BindingDB
Found 2 hits for monomerid = 159252
Trg + Lig
Ki
nM
ΔG°
kcal/mole
IC50
nM
Kd
nM
EC50/IC50
nM
koff
s-1
kon
M-1s-1
pHTemp
°C
Histamine H3 receptor
(Homo sapiens (Human))
BDBM159252
(US9034874, 2.3)
Show SMILES CC(C)N1CCN(CC1)C(=O)OC1CCN(CC1)c1cc[nH]c(=O)c1
Show InChI InChI=1S/C18H28N4O3/c1-14(2)20-9-11-22(12-10-20)18(24)25-16-4-7-21(8-5-16)15-3-6-19-17(23)13-15/h3,6,13-14,16H,4-5,7-12H2,1-2H3,(H,19,23)
Reactome pathway
US Patent
0.900n/an/an/an/an/an/an/an/a
NOVARTIS AG
US Patent
Assay Description
The potency of compounds of the invention as H3 receptor antagonists can be assessed by measuring the blockade of (R)-alpha-methylhistamine-mediated ...
US Patent US9034874 (2015)
BindingDB Entry DOI: 10.7270/Q2C82819
Histamine H3 receptor
(Homo sapiens (Human))
BDBM159252
(US9034874, 2.3)
Show SMILES CC(C)N1CCN(CC1)C(=O)OC1CCN(CC1)c1cc[nH]c(=O)c1
Show InChI InChI=1S/C18H28N4O3/c1-14(2)20-9-11-22(12-10-20)18(24)25-16-4-7-21(8-5-16)15-3-6-19-17(23)13-15/h3,6,13-14,16H,4-5,7-12H2,1-2H3,(H,19,23)
Reactome pathway
US Patent
12n/an/an/an/an/an/a7.5n/a
NOVARTIS AG
US Patent
Assay Description
The affinity of compounds of the invention to the H3 receptor can be assessed by measuring displacement of binding of the radioligand [3H]-N-alpha -M...
US Patent US9034874 (2015)
BindingDB Entry DOI: 10.7270/Q2C82819