BDBM159314 US9682968, Example-17-3
SMILES: Cc1cc(C2CC2)c(CN2CCCC[C@H]2c2ccc(nc2)C(O)=O)c2cc[nH]c12
InChI Key:
Data: 1 IC50
Activity Spreadsheet -- Enzyme Inhibition Constant Data from BindingDB
Found 1 hit for monomerid = 159314
Trg + Lig
Ki
nM
ΔG°
kcal/mole
IC50
nM
Kd
nM
EC50/IC50
nM
koff
s-1
kon
M-1s-1
pHTemp
°C
Complement factor B
(Homo sapiens (Human))
BDBM159314
(US9682968, Example-17-3)
Show SMILES Cc1cc(C2CC2)c(CN2CCCC[C@H]2c2ccc(nc2)C(O)=O)c2cc[nH]c12 |r|
US Patent
n/an/a 0.0400n/an/an/an/an/an/a
Novartis AG
US Patent
Assay Description
CVF-Bb complex prepared from purified cobra venom factor (1 μM), recombinant human complement factor B (expressed in drosophila cells and purifi...
US Patent US9682968 (2017)
BindingDB Entry DOI: 10.7270/Q2XG9P9J