null
SMILES: COc1cc(ccc1[C@@H]1CCCCN1Cc1c(cc(C)c2[nH]ccc12)C1CC1)C(O)=O
InChI Key:
Activity Spreadsheet -- Enzyme Inhibition Constant Data from BindingDB
Found 1 hit for monomerid = 159316
Trg + Lig
Ki
nM
ΔG°
kcal/mole
IC50
nM
Kd
nM
EC50/IC50
nM
koff
s-1
kon
M-1s-1
pHTemp
°C
Complement factor B
(Homo sapiens (Human))
BDBM159316
(US9682968, Example-17-4)
Show SMILES COc1cc(ccc1[C@@H]1CCCCN1Cc1c(cc(C)c2[nH]ccc12)C1CC1)C(O)=O |r|
US Patent
n/an/a 0.0900n/an/an/an/an/an/a
Novartis AG
US Patent
Assay Description
CVF-Bb complex prepared from purified cobra venom factor (1 μM), recombinant human complement factor B (expressed in drosophila cells and purifi...
US Patent US9682968 (2017)
BindingDB Entry DOI: 10.7270/Q2XG9P9J