BDBM159451 US9034921, E091
SMILES: CS[C@H]1O[C@H]([C@H](O)[C@@H](O)[C@@H]1O)c1ccc(Cl)c(Cc2ccc3OCCOc3c2)c1
InChI Key: InChIKey=ITPVCQIIDNERCQ-CRSSMBPESA-N
Data: 1 IC50
Activity Spreadsheet -- Enzyme Inhibition Constant Data from BindingDB
Found 1 hit for monomerid = 159451
Trg + Lig
Ki
nM
ΔG°
kcal/mole
IC50
nM
Kd
nM
EC50/IC50
nM
koff
s-1
kon
M-1s-1
pHTemp
°C
Sodium/glucose cotransporter 2
(Homo sapiens (Human))
BDBM159451
(US9034921, E091)
Show SMILES CS[C@H]1O[C@H]([C@H](O)[C@@H](O)[C@@H]1O)c1ccc(Cl)c(Cc2ccc3OCCOc3c2)c1 |r|
Show InChI InChI=1S/C21H23ClO6S/c1-29-21-19(25)17(23)18(24)20(28-21)12-3-4-14(22)13(10-12)8-11-2-5-15-16(9-11)27-7-6-26-15/h2-5,9-10,17-21,23-25H,6-8H2,1H3/t17-,18-,19+,20+,21-/m1/s1
US Patent
n/an/a 0.629n/an/an/an/a7.437
GREEN CROSS CORPORATION
US Patent
Assay Description
For sodium-dependent glucose transport assay, cells expressing hSGLT2 were seeded into a 96-well culture plate at a density of 5x104 cells/well in RP...
US Patent US9034921 (2015)
BindingDB Entry DOI: 10.7270/Q2QF8RMT