BDBM159537 US9034921, E180
SMILES: CC(=C)c1ccc(Cc2cc([C@@H]3O[C@H](CO)[C@@H](O)[C@H](O)[C@H]3O)c3CCOc3c2Cl)cc1
InChI Key: InChIKey=GFUGOYINRRCSBW-YVTYUBGGSA-N
Data: 1 IC50
Activity Spreadsheet -- Enzyme Inhibition Constant Data from BindingDB
Found 1 hit for monomerid = 159537
Trg + Lig
Ki
nM
ΔG°
kcal/mole
IC50
nM
Kd
nM
EC50/IC50
nM
koff
s-1
kon
M-1s-1
pHTemp
°C
Sodium/glucose cotransporter 2
(Homo sapiens (Human))
BDBM159537
(US9034921, E180)
Show SMILES CC(=C)c1ccc(Cc2cc([C@@H]3O[C@H](CO)[C@@H](O)[C@H](O)[C@H]3O)c3CCOc3c2Cl)cc1 |r|
Show InChI InChI=1S/C24H27ClO6/c1-12(2)14-5-3-13(4-6-14)9-15-10-17(16-7-8-30-23(16)19(15)25)24-22(29)21(28)20(27)18(11-26)31-24/h3-6,10,18,20-22,24,26-29H,1,7-9,11H2,2H3/t18-,20-,21+,22-,24+/m1/s1
US Patent
n/an/a 0.574n/an/an/an/a7.437
GREEN CROSS CORPORATION
US Patent
Assay Description
For sodium-dependent glucose transport assay, cells expressing hSGLT2 were seeded into a 96-well culture plate at a density of 5x104 cells/well in RP...
US Patent US9034921 (2015)
BindingDB Entry DOI: 10.7270/Q2QF8RMT