null
SMILES: Cc1nc(sc1CN1CCc2cc(ccc2C1)S(=O)(=O)Nc1ccc(CCCC2CCCC2)cc1F)-c1ccc(cc1)C(F)(F)F
InChI Key: InChIKey=RQYAWYZPFCUBFM-UHFFFAOYSA-N
Activity Spreadsheet -- Enzyme Inhibition Constant Data from BindingDB
Found 1 hit for monomerid = 159634
Trg + Lig
Ki
nM
ΔG°
kcal/mole
IC50
nM
Kd
nM
EC50/IC50
nM
koff
s-1
kon
M-1s-1
pHTemp
°C
2-acylglycerol O-acyltransferase 2
(Homo sapiens (Human))
BDBM159634
(US9035059, 6-65)
Show SMILES Cc1nc(sc1CN1CCc2cc(ccc2C1)S(=O)(=O)Nc1ccc(CCCC2CCCC2)cc1F)-c1ccc(cc1)C(F)(F)F
Show InChI InChI=1S/C35H37F4N3O2S2/c1-23-33(45-34(40-23)26-10-13-29(14-11-26)35(37,38)39)22-42-18-17-27-20-30(15-12-28(27)21-42)46(43,44)41-32-16-9-25(19-31(32)36)8-4-7-24-5-2-3-6-24/h9-16,19-20,24,41H,2-8,17-18,21-22H2,1H3
US Patent
n/an/a 51n/an/an/an/an/an/a
TAISHO PHARMACEUTICAL CO., LTD.
US Patent
Assay Description
A test for MGAT2 inhibitory action of test compounds was conducted in accordance with a partially modified version of the method described in John F....
US Patent US9035059 (2015)
BindingDB Entry DOI: 10.7270/Q2B856WH