BDBM159666 US9035059, 8-5
SMILES: CC(C)(C)c1ccc(CCN2CCc3cc(ccc3C2)S(=O)(=O)Nc2ccc(OCCC3CCCC3)cc2F)cc1
InChI Key: InChIKey=LNKICVDRQYZAJN-UHFFFAOYSA-N
Data: 1 IC50
Activity Spreadsheet -- Enzyme Inhibition Constant Data from BindingDB
Found 1 hit for monomerid = 159666
Trg + Lig
Ki
nM
ΔG°
kcal/mole
IC50
nM
Kd
nM
EC50/IC50
nM
koff
s-1
kon
M-1s-1
pHTemp
°C
Acyl-CoA:monoacylglycerol acyltransferase 2 (MOGAT2)
(Homo sapiens (Human))
BDBM159666
(US9035059, 8-5)
Show SMILES CC(C)(C)c1ccc(CCN2CCc3cc(ccc3C2)S(=O)(=O)Nc2ccc(OCCC3CCCC3)cc2F)cc1
Show InChI InChI=1S/C34H43FN2O3S/c1-34(2,3)29-11-8-26(9-12-29)16-19-37-20-17-27-22-31(14-10-28(27)24-37)41(38,39)36-33-15-13-30(23-32(33)35)40-21-18-25-6-4-5-7-25/h8-15,22-23,25,36H,4-7,16-21,24H2,1-3H3
US Patent
n/an/a 29n/an/an/an/an/a25
TAISHO PHARMACEUTICAL CO., LTD.
US Patent
Assay Description
An MGAT2 inhibition test for test compounds was conducted in accordance with a partially modified version of the method described in John F. Lockwood...
US Patent US9035059 (2015)
BindingDB Entry DOI: 10.7270/Q2B856WH