BDBM159730 US9035059, 20-2
SMILES: CC(C)(C)c1ccc(CC(C)(C)N2CCc3cc(ccc3C2)S(=O)(=O)Nc2ccc(CCCC3CCCC3)cc2F)cc1
InChI Key: InChIKey=LGCKNNFUYPBHPG-UHFFFAOYSA-N
Data: 1 IC50
Activity Spreadsheet -- Enzyme Inhibition Constant Data from BindingDB
Found 1 hit for monomerid = 159730
Trg + Lig
Ki
nM
ΔG°
kcal/mole
IC50
nM
Kd
nM
EC50/IC50
nM
koff
s-1
kon
M-1s-1
pHTemp
°C
Acyl-CoA:monoacylglycerol acyltransferase 2 (MOGAT2)
(Homo sapiens (Human))
BDBM159730
(US9035059, 20-2)
Show SMILES CC(C)(C)c1ccc(CC(C)(C)N2CCc3cc(ccc3C2)S(=O)(=O)Nc2ccc(CCCC3CCCC3)cc2F)cc1
Show InChI InChI=1S/C37H49FN2O2S/c1-36(2,3)32-17-13-29(14-18-32)25-37(4,5)40-22-21-30-24-33(19-16-31(30)26-40)43(41,42)39-35-20-15-28(23-34(35)38)12-8-11-27-9-6-7-10-27/h13-20,23-24,27,39H,6-12,21-22,25-26H2,1-5H3
US Patent
n/an/a 14n/an/an/an/an/a25
TAISHO PHARMACEUTICAL CO., LTD.
US Patent
Assay Description
An MGAT2 inhibition test for test compounds was conducted in accordance with a partially modified version of the method described in John F. Lockwood...
US Patent US9035059 (2015)
BindingDB Entry DOI: 10.7270/Q2B856WH