BDBM159736 US9035059, 23-3
SMILES: CC(N1CCc2cc(ccc2C1)S(=O)(=O)Nc1ccc(CCCC2CCCC2)cc1F)c1ccnc(c1)C(C)(C)C
InChI Key: InChIKey=QNYMXEJETOPZSB-UHFFFAOYSA-N
Data: 1 IC50
Activity Spreadsheet -- Enzyme Inhibition Constant Data from BindingDB
Found 1 hit for monomerid = 159736
Trg + Lig
Ki
nM
ΔG°
kcal/mole
IC50
nM
Kd
nM
EC50/IC50
nM
koff
s-1
kon
M-1s-1
pHTemp
°C
Acyl-CoA:monoacylglycerol acyltransferase 2 (MOGAT2)
(Homo sapiens (Human))
BDBM159736
(US9035059, 23-3)
Show SMILES CC(N1CCc2cc(ccc2C1)S(=O)(=O)Nc1ccc(CCCC2CCCC2)cc1F)c1ccnc(c1)C(C)(C)C
Show InChI InChI=1S/C34H44FN3O2S/c1-24(27-16-18-36-33(22-27)34(2,3)4)38-19-17-28-21-30(14-13-29(28)23-38)41(39,40)37-32-15-12-26(20-31(32)35)11-7-10-25-8-5-6-9-25/h12-16,18,20-22,24-25,37H,5-11,17,19,23H2,1-4H3
US Patent
n/an/a 13n/an/an/an/an/a25
TAISHO PHARMACEUTICAL CO., LTD.
US Patent
Assay Description
An MGAT2 inhibition test for test compounds was conducted in accordance with a partially modified version of the method described in John F. Lockwood...
US Patent US9035059 (2015)
BindingDB Entry DOI: 10.7270/Q2B856WH