BDBM159751 US10966980, Example 4A::US9035074, 4A
SMILES: CN([C@@H]1C[C@@H](C1)NS(=O)(=O)[C@@H]1C[C@H](CC#N)C1)c1ncnc2[nH]ccc12
InChI Key:
Data: 8 IC50
Activity Spreadsheet -- Enzyme Inhibition Constant Data from BindingDB
Found 8 hits for monomerid = 159751
Trg + Lig
Ki
nM
ΔG°
kcal/mole
IC50
nM
Kd
nM
EC50/IC50
nM
koff
s-1
kon
M-1s-1
pHTemp
°C
Tyrosine-protein kinase JAK1
(Homo sapiens (Human))
BDBM159751
(US10966980, Example 4A | US9035074, 4A)
Show SMILES CN([C@@H]1C[C@@H](C1)NS(=O)(=O)[C@@H]1C[C@H](CC#N)C1)c1ncnc2[nH]ccc12 |r,wU:10.10,12.13,wD:2.1,4.6,(-5.89,1.48,;-4.55,.71,;-3.22,1.48,;-2.82,2.97,;-1.33,2.57,;-1.73,1.09,;,3.34,;1.33,2.57,;.56,1.24,;2.1,3.91,;2.67,1.8,;3.07,.32,;4.55,.71,;5.89,-.06,;5.89,-1.6,;5.89,-3.14,;4.15,2.2,;-4.55,-.83,;-5.89,-1.6,;-5.89,-3.14,;-4.55,-3.91,;-3.22,-3.14,;-1.76,-3.61,;-.85,-2.37,;-1.76,-1.12,;-3.22,-1.6,)|
Reactome pathway
US Patent
n/an/a 18n/an/an/an/a7.425
Pfizer Inc.
US Patent
Assay Description
Test article and assay controls were added to a 384-well plate. Reaction mixtures contained 20 mM HEPES, pH 7.4, 10 mM magnesium chloride, 0.01% bovi...
US Patent US9035074 (2015)
BindingDB Entry DOI: 10.7270/Q26H4G56
Tyrosine-protein kinase JAK2
(Homo sapiens (Human))
BDBM159751
(US10966980, Example 4A | US9035074, 4A)
Show SMILES CN([C@@H]1C[C@@H](C1)NS(=O)(=O)[C@@H]1C[C@H](CC#N)C1)c1ncnc2[nH]ccc12 |r,wU:10.10,12.13,wD:2.1,4.6,(-5.89,1.48,;-4.55,.71,;-3.22,1.48,;-2.82,2.97,;-1.33,2.57,;-1.73,1.09,;,3.34,;1.33,2.57,;.56,1.24,;2.1,3.91,;2.67,1.8,;3.07,.32,;4.55,.71,;5.89,-.06,;5.89,-1.6,;5.89,-3.14,;4.15,2.2,;-4.55,-.83,;-5.89,-1.6,;-5.89,-3.14,;-4.55,-3.91,;-3.22,-3.14,;-1.76,-3.61,;-.85,-2.37,;-1.76,-1.12,;-3.22,-1.6,)|
Reactome pathway
US Patent
n/an/a 1.40E+3n/an/an/an/a7.425
Pfizer Inc.
US Patent
Assay Description
Test article and assay controls were added to a 384-well plate. Reaction mixtures contained 20 mM HEPES, pH 7.4, 10 mM magnesium chloride, 0.01% bovi...
US Patent US9035074 (2015)
BindingDB Entry DOI: 10.7270/Q26H4G56
Tyrosine-protein kinase JAK3
(Homo sapiens (Human))
BDBM159751
(US10966980, Example 4A | US9035074, 4A)
Show SMILES CN([C@@H]1C[C@@H](C1)NS(=O)(=O)[C@@H]1C[C@H](CC#N)C1)c1ncnc2[nH]ccc12 |r,wU:10.10,12.13,wD:2.1,4.6,(-5.89,1.48,;-4.55,.71,;-3.22,1.48,;-2.82,2.97,;-1.33,2.57,;-1.73,1.09,;,3.34,;1.33,2.57,;.56,1.24,;2.1,3.91,;2.67,1.8,;3.07,.32,;4.55,.71,;5.89,-.06,;5.89,-1.6,;5.89,-3.14,;4.15,2.2,;-4.55,-.83,;-5.89,-1.6,;-5.89,-3.14,;-4.55,-3.91,;-3.22,-3.14,;-1.76,-3.61,;-.85,-2.37,;-1.76,-1.12,;-3.22,-1.6,)|
Reactome pathway
US Patent
n/an/a>1.00E+4n/an/an/an/a7.425
Pfizer Inc.
US Patent
Assay Description
Test article and assay controls were added to a 384-well plate. Reaction mixtures contained 20 mM HEPES, pH 7.4, 10 mM magnesium chloride, 0.01% bovi...
US Patent US9035074 (2015)
BindingDB Entry DOI: 10.7270/Q26H4G56
Non-receptor tyrosine-protein kinase TYK2
(Homo sapiens (Human))
BDBM159751
(US10966980, Example 4A | US9035074, 4A)
Show SMILES CN([C@@H]1C[C@@H](C1)NS(=O)(=O)[C@@H]1C[C@H](CC#N)C1)c1ncnc2[nH]ccc12 |r,wU:10.10,12.13,wD:2.1,4.6,(-5.89,1.48,;-4.55,.71,;-3.22,1.48,;-2.82,2.97,;-1.33,2.57,;-1.73,1.09,;,3.34,;1.33,2.57,;.56,1.24,;2.1,3.91,;2.67,1.8,;3.07,.32,;4.55,.71,;5.89,-.06,;5.89,-1.6,;5.89,-3.14,;4.15,2.2,;-4.55,-.83,;-5.89,-1.6,;-5.89,-3.14,;-4.55,-3.91,;-3.22,-3.14,;-1.76,-3.61,;-.85,-2.37,;-1.76,-1.12,;-3.22,-1.6,)|
US Patent
n/an/a 2.71E+3n/an/an/an/an/an/a
Pfizer Inc.
US Patent
Assay Description
Test article and assay controls were added to a 384-well plate. Reaction mixtures contained 20 mM HEPES, pH 7.4, 10 mM magnesium chloride, 0.01% bovi...
US Patent US10966980 (2021)
Tyrosine-protein kinase JAK1
(Homo sapiens (Human))
BDBM159751
(US10966980, Example 4A | US9035074, 4A)
Show SMILES CN([C@@H]1C[C@@H](C1)NS(=O)(=O)[C@@H]1C[C@H](CC#N)C1)c1ncnc2[nH]ccc12 |r,wU:10.10,12.13,wD:2.1,4.6,(-5.89,1.48,;-4.55,.71,;-3.22,1.48,;-2.82,2.97,;-1.33,2.57,;-1.73,1.09,;,3.34,;1.33,2.57,;.56,1.24,;2.1,3.91,;2.67,1.8,;3.07,.32,;4.55,.71,;5.89,-.06,;5.89,-1.6,;5.89,-3.14,;4.15,2.2,;-4.55,-.83,;-5.89,-1.6,;-5.89,-3.14,;-4.55,-3.91,;-3.22,-3.14,;-1.76,-3.61,;-.85,-2.37,;-1.76,-1.12,;-3.22,-1.6,)|
Reactome pathway
US Patent
n/an/a 18n/an/an/an/an/an/a
Pfizer Inc.
US Patent
Assay Description
Test article and assay controls were added to a 384-well plate. Reaction mixtures contained 20 mM HEPES, pH 7.4, 10 mM magnesium chloride, 0.01% bovi...
US Patent US10966980 (2021)
Tyrosine-protein kinase JAK2
(Homo sapiens (Human))
BDBM159751
(US10966980, Example 4A | US9035074, 4A)
Show SMILES CN([C@@H]1C[C@@H](C1)NS(=O)(=O)[C@@H]1C[C@H](CC#N)C1)c1ncnc2[nH]ccc12 |r,wU:10.10,12.13,wD:2.1,4.6,(-5.89,1.48,;-4.55,.71,;-3.22,1.48,;-2.82,2.97,;-1.33,2.57,;-1.73,1.09,;,3.34,;1.33,2.57,;.56,1.24,;2.1,3.91,;2.67,1.8,;3.07,.32,;4.55,.71,;5.89,-.06,;5.89,-1.6,;5.89,-3.14,;4.15,2.2,;-4.55,-.83,;-5.89,-1.6,;-5.89,-3.14,;-4.55,-3.91,;-3.22,-3.14,;-1.76,-3.61,;-.85,-2.37,;-1.76,-1.12,;-3.22,-1.6,)|
Reactome pathway
US Patent
n/an/a 1.40E+3n/an/an/an/an/an/a
Pfizer Inc.
US Patent
Assay Description
Test article and assay controls were added to a 384-well plate. Reaction mixtures contained 20 mM HEPES, pH 7.4, 10 mM magnesium chloride, 0.01% bovi...
US Patent US10966980 (2021)
Tyrosine-protein kinase JAK3
(Homo sapiens (Human))
BDBM159751
(US10966980, Example 4A | US9035074, 4A)
Show SMILES CN([C@@H]1C[C@@H](C1)NS(=O)(=O)[C@@H]1C[C@H](CC#N)C1)c1ncnc2[nH]ccc12 |r,wU:10.10,12.13,wD:2.1,4.6,(-5.89,1.48,;-4.55,.71,;-3.22,1.48,;-2.82,2.97,;-1.33,2.57,;-1.73,1.09,;,3.34,;1.33,2.57,;.56,1.24,;2.1,3.91,;2.67,1.8,;3.07,.32,;4.55,.71,;5.89,-.06,;5.89,-1.6,;5.89,-3.14,;4.15,2.2,;-4.55,-.83,;-5.89,-1.6,;-5.89,-3.14,;-4.55,-3.91,;-3.22,-3.14,;-1.76,-3.61,;-.85,-2.37,;-1.76,-1.12,;-3.22,-1.6,)|
Reactome pathway
US Patent
n/an/a>1.00E+4n/an/an/an/an/an/a
Pfizer Inc.
US Patent
Assay Description
Test article and assay controls were added to a 384-well plate. Reaction mixtures contained 20 mM HEPES, pH 7.4, 10 mM magnesium chloride, 0.01% bovi...
US Patent US10966980 (2021)
Non-receptor tyrosine-protein kinase TYK2
(Homo sapiens (Human))
BDBM159751
(US10966980, Example 4A | US9035074, 4A)
Show SMILES CN([C@@H]1C[C@@H](C1)NS(=O)(=O)[C@@H]1C[C@H](CC#N)C1)c1ncnc2[nH]ccc12 |r,wU:10.10,12.13,wD:2.1,4.6,(-5.89,1.48,;-4.55,.71,;-3.22,1.48,;-2.82,2.97,;-1.33,2.57,;-1.73,1.09,;,3.34,;1.33,2.57,;.56,1.24,;2.1,3.91,;2.67,1.8,;3.07,.32,;4.55,.71,;5.89,-.06,;5.89,-1.6,;5.89,-3.14,;4.15,2.2,;-4.55,-.83,;-5.89,-1.6,;-5.89,-3.14,;-4.55,-3.91,;-3.22,-3.14,;-1.76,-3.61,;-.85,-2.37,;-1.76,-1.12,;-3.22,-1.6,)|
US Patent
n/an/a 2.71E+3n/an/an/an/a7.425
Pfizer Inc.
US Patent
Assay Description
Test article and assay controls were added to a 384-well plate. Reaction mixtures contained 20 mM HEPES, pH 7.4, 10 mM magnesium chloride, 0.01% bovi...
US Patent US9035074 (2015)
BindingDB Entry DOI: 10.7270/Q26H4G56