BDBM15993 2-({2-[(3-hydroxyphenyl)amino]pyrimidin-4-yl}amino)benzoic acid::4-anilinopyrimidine 8c
SMILES: OC(=O)c1ccccc1Nc1ccnc(Nc2cccc(O)c2)n1
InChI Key: InChIKey=LYNBNVBMAGDJRW-UHFFFAOYSA-N
Data: 3 IC50
Activity Spreadsheet -- Enzyme Inhibition Constant Data from BindingDB
Found 3 hits for monomerid = 15993
Trg + Lig
Ki
nM
ΔG°
kcal/mole
IC50
nM
Kd
nM
EC50/IC50
nM
koff
s-1
kon
M-1s-1
pHTemp
°C
Mitogen-activated protein kinase 8
(Homo sapiens (Human))
BDBM15993
(2-({2-[(3-hydroxyphenyl)amino]pyrimidin-4-yl}amino...)
Show SMILES OC(=O)c1ccccc1Nc1ccnc(Nc2cccc(O)c2)n1
Show InChI InChI=1S/C17H14N4O3/c22-12-5-3-4-11(10-12)19-17-18-9-8-15(21-17)20-14-7-2-1-6-13(14)16(23)24/h1-10,22H,(H,23,24)(H2,18,19,20,21)
NCI pathway
Reactome pathway
n/an/a 25n/an/an/an/a7.220
Abbott Laboratories
Assay Description
In vitro substrate phosphorylation using purified recombinant JNK, was incubated with substrate, and test compounds in the presence of 5uM ATP/ [gamm...
Bioorg Med Chem Lett 17: 668-72 (2007)
Article DOI: 10.1016/j.bmcl.2006.10.093
BindingDB Entry DOI: 10.7270/Q2J964N4
Mitogen-activated protein kinase 8
(Homo sapiens (Human))
BDBM15993
(2-({2-[(3-hydroxyphenyl)amino]pyrimidin-4-yl}amino...)
Show SMILES OC(=O)c1ccccc1Nc1ccnc(Nc2cccc(O)c2)n1
Show InChI InChI=1S/C17H14N4O3/c22-12-5-3-4-11(10-12)19-17-18-9-8-15(21-17)20-14-7-2-1-6-13(14)16(23)24/h1-10,22H,(H,23,24)(H2,18,19,20,21)
NCI pathway
Reactome pathway
n/an/a 40n/an/an/an/an/an/a
Semmelweis University
Curated by ChEMBL
Assay Description
Inhibition of JNK1 (unknown origin)
Bioorg Med Chem Lett 26: 424-8 (2016)
BindingDB Entry DOI: 10.7270/Q24T6M6J
Mitogen-activated protein kinase 8
(Homo sapiens (Human))
BDBM15993
(2-({2-[(3-hydroxyphenyl)amino]pyrimidin-4-yl}amino...)
Show SMILES OC(=O)c1ccccc1Nc1ccnc(Nc2cccc(O)c2)n1
Show InChI InChI=1S/C17H14N4O3/c22-12-5-3-4-11(10-12)19-17-18-9-8-15(21-17)20-14-7-2-1-6-13(14)16(23)24/h1-10,22H,(H,23,24)(H2,18,19,20,21)
NCI pathway
Reactome pathway
n/an/a 25n/an/an/an/an/an/a
Semmelweis University
Curated by ChEMBL
Assay Description
Inhibition of JNK1alpha1 (unknown origin)
Bioorg Med Chem Lett 26: 424-8 (2016)
BindingDB Entry DOI: 10.7270/Q24T6M6J