BDBM15995 2-{[2-(phenylamino)pyrimidin-4-yl]amino}benzamide::4-anilinopyrimidine 2a
SMILES: NC(=O)c1ccccc1Nc1ccnc(Nc2ccccc2)n1
InChI Key: InChIKey=TVKTVNQGZQPCAT-UHFFFAOYSA-N
Data: 1 IC50
PDB links: 1 PDB ID contains this monomer as substructures. 1 PDB ID contains inhibitors having a similarity of 90% to this monomer.
Activity Spreadsheet -- Enzyme Inhibition Constant Data from BindingDB
Found 1 hit for monomerid = 15995
Trg + Lig
Ki
nM
ΔG°
kcal/mole
IC50
nM
Kd
nM
EC50/IC50
nM
koff
s-1
kon
M-1s-1
pHTemp
°C
Mitogen-activated protein kinase 8
(Homo sapiens (Human))
BDBM15995
(2-{[2-(phenylamino)pyrimidin-4-yl]amino}benzamide ...)
Show SMILES NC(=O)c1ccccc1Nc1ccnc(Nc2ccccc2)n1
Show InChI InChI=1S/C17H15N5O/c18-16(23)13-8-4-5-9-14(13)21-15-10-11-19-17(22-15)20-12-6-2-1-3-7-12/h1-11H,(H2,18,23)(H2,19,20,21,22)
NCI pathway
Reactome pathway
n/an/a 34n/an/an/an/a7.220
Abbott Laboratories
Assay Description
In vitro substrate phosphorylation using purified recombinant JNK, was incubated with substrate, and test compounds in the presence of 5uM ATP/ [gamm...
Bioorg Med Chem Lett 17: 668-72 (2007)
Article DOI: 10.1016/j.bmcl.2006.10.093
BindingDB Entry DOI: 10.7270/Q2J964N4