BDBM15996 2-({2-[(2-fluorophenyl)amino]pyrimidin-4-yl}amino)benzoic acid::4-anilinopyrimidine 8e
SMILES: OC(=O)c1ccccc1Nc1ccnc(Nc2ccccc2F)n1
InChI Key: InChIKey=POWPXRKPMNQSDN-UHFFFAOYSA-N
Data: 1 IC50
Activity Spreadsheet -- Enzyme Inhibition Constant Data from BindingDB
Found 1 hit for monomerid = 15996
Trg + Lig
Ki
nM
ΔG°
kcal/mole
IC50
nM
Kd
nM
EC50/IC50
nM
koff
s-1
kon
M-1s-1
pHTemp
°C
Mitogen-activated protein kinase 8
(Homo sapiens (Human))
BDBM15996
(2-({2-[(2-fluorophenyl)amino]pyrimidin-4-yl}amino)...)
Show SMILES OC(=O)c1ccccc1Nc1ccnc(Nc2ccccc2F)n1
Show InChI InChI=1S/C17H13FN4O2/c18-12-6-2-4-8-14(12)21-17-19-10-9-15(22-17)20-13-7-3-1-5-11(13)16(23)24/h1-10H,(H,23,24)(H2,19,20,21,22)
NCI pathway
Reactome pathway
n/an/a 35n/an/an/an/an/an/a
Abbott Laboratories
Assay Description
In vitro substrate phosphorylation using purified recombinant JNK, was incubated with substrate, and test compounds in the presence of 5uM ATP/ [gamm...
Bioorg Med Chem Lett 17: 668-72 (2007)
Article DOI: 10.1016/j.bmcl.2006.10.093
BindingDB Entry DOI: 10.7270/Q2J964N4