BDBM16013 2-{[5-bromo-2-(phenylamino)pyrimidin-4-yl]amino}benzoic acid::4-anilinopyrimidine 14c
SMILES: OC(=O)c1ccccc1Nc1nc(Nc2ccccc2)ncc1Br
InChI Key: InChIKey=JCKOZYLWQZFIIG-UHFFFAOYSA-N
Data: 1 IC50
Activity Spreadsheet -- Enzyme Inhibition Constant Data from BindingDB
Found 1 hit for monomerid = 16013
Trg + Lig
Ki
nM
ΔG°
kcal/mole
IC50
nM
Kd
nM
EC50/IC50
nM
koff
s-1
kon
M-1s-1
pHTemp
°C
Mitogen-activated protein kinase 8
(Homo sapiens (Human))
BDBM16013
(2-{[5-bromo-2-(phenylamino)pyrimidin-4-yl]amino}be...)
Show SMILES OC(=O)c1ccccc1Nc1nc(Nc2ccccc2)ncc1Br
Show InChI InChI=1S/C17H13BrN4O2/c18-13-10-19-17(20-11-6-2-1-3-7-11)22-15(13)21-14-9-5-4-8-12(14)16(23)24/h1-10H,(H,23,24)(H2,19,20,21,22)
NCI pathway
Reactome pathway
n/an/a 32n/an/an/an/an/an/a
Abbott Laboratories
Assay Description
In vitro substrate phosphorylation using purified recombinant JNK, was incubated with substrate, and test compounds in the presence of 5uM ATP/ [gamm...
Bioorg Med Chem Lett 17: 668-72 (2007)
Article DOI: 10.1016/j.bmcl.2006.10.093
BindingDB Entry DOI: 10.7270/Q2J964N4