BDBM160167 US9040663, 13
SMILES: CC(=O)N[C@@H](CCCNC(N)=N)C(=O)N[C@H]1CCC(=O)NCCC[C@H](NC(=O)[C@H](Cc2c[nH]c3ccccc23)NC(=O)[C@H](CCCNC(N)=N)NC(=O)[C@@H](Cc2ccccc2C(F)(F)F)NC(=O)[C@H](CCN)NC1=O)C(N)=O
InChI Key:
Data: 2 KI
Activity Spreadsheet -- Enzyme Inhibition Constant Data from BindingDB
Found 2 hits for monomerid = 160167
Trg + Lig
Ki
nM
ΔG°
kcal/mole
IC50
nM
Kd
nM
EC50/IC50
nM
koff
s-1
kon
M-1s-1
pHTemp
°C
Melanocortin receptor 4
(Homo sapiens (Human))
BDBM160167
(US9040663, 13)
Show SMILES CC(=O)N[C@@H](CCCNC(N)=N)C(=O)N[C@H]1CCC(=O)NCCC[C@H](NC(=O)[C@H](Cc2c[nH]c3ccccc23)NC(=O)[C@H](CCCNC(N)=N)NC(=O)[C@@H](Cc2ccccc2C(F)(F)F)NC(=O)[C@H](CCN)NC1=O)C(N)=O |r|
US Patent
0.600 -13.1n/an/an/an/an/a7.537
AstraZeneca AB
US Patent
Assay Description
A competitive inhibition binding assay was performed for exemplified peptides according to the invention using membrane homogenates prepared from HEK...
US Patent US9040663 (2015)
BindingDB Entry DOI: 10.7270/Q29885SK
Melanocyte-stimulating hormone receptor
(Homo sapiens (Human))
BDBM160167
(US9040663, 13)
Show SMILES CC(=O)N[C@@H](CCCNC(N)=N)C(=O)N[C@H]1CCC(=O)NCCC[C@H](NC(=O)[C@H](Cc2c[nH]c3ccccc23)NC(=O)[C@H](CCCNC(N)=N)NC(=O)[C@@H](Cc2ccccc2C(F)(F)F)NC(=O)[C@H](CCN)NC1=O)C(N)=O |r|
US Patent
3 -12.1n/an/an/an/an/a7.537
AstraZeneca AB
US Patent
Assay Description
A competitive inhibition binding assay was performed for exemplified peptides according to the invention using membrane homogenates prepared from HEK...
US Patent US9040663 (2015)
BindingDB Entry DOI: 10.7270/Q29885SK