BDBM160180 US9040663, 26
SMILES: CC(=O)N[C@@H](CCCNC(N)=N)C(=O)N[C@H]1CCC(=O)NCCC[C@H](NC(=O)[C@H](Cc2c[nH]c3ccccc23)NC(=O)[C@H](CCCNC(N)=N)NC(=O)[C@@H](Cc2ccc(F)c(F)c2)NC(=O)[C@H](CCN)NC1=O)C(N)=O
InChI Key:
Data: 1 KI
Activity Spreadsheet -- Enzyme Inhibition Constant Data from BindingDB
Found 1 hit for monomerid = 160180
Trg + Lig
Ki
nM
ΔG°
kcal/mole
IC50
nM
Kd
nM
EC50/IC50
nM
koff
s-1
kon
M-1s-1
pHTemp
°C
Melanocortin receptor 4
(Homo sapiens (Human))
BDBM160180
(US9040663, 26)
Show SMILES CC(=O)N[C@@H](CCCNC(N)=N)C(=O)N[C@H]1CCC(=O)NCCC[C@H](NC(=O)[C@H](Cc2c[nH]c3ccccc23)NC(=O)[C@H](CCCNC(N)=N)NC(=O)[C@@H](Cc2ccc(F)c(F)c2)NC(=O)[C@H](CCN)NC1=O)C(N)=O |r|
US Patent
0.300 -13.5n/an/an/an/an/a7.537
AstraZeneca AB
US Patent
Assay Description
A competitive inhibition binding assay was performed for exemplified peptides according to the invention using membrane homogenates prepared from HEK...
US Patent US9040663 (2015)
BindingDB Entry DOI: 10.7270/Q29885SK