null
SMILES: Cc1c(Br)c(=O)oc2c(C=O)c(O)c(F)cc12
InChI Key: InChIKey=SXGCAXPMWPSLBL-UHFFFAOYSA-N
Activity Spreadsheet -- Enzyme Inhibition Constant Data from BindingDB
Found 2 hits for monomerid = 160342
Trg + Lig
Ki
nM
ΔG°
kcal/mole
IC50
nM
Kd
nM
EC50/IC50
nM
koff
s-1
kon
M-1s-1
pHTemp
°C
Serine/threonine-protein kinase/endoribonuclease IRE1
(Homo sapiens (Human))
BDBM160342
(US9040714, 9 | US9693992, 9)
Show SMILES Cc1c(Br)c(=O)oc2c(C=O)c(O)c(F)cc12
Show InChI InChI=1S/C11H6BrFO4/c1-4-5-2-7(13)9(15)6(3-14)10(5)17-11(16)8(4)12/h2-3,15H,1H3
Reactome pathway
US Patent
n/an/a<1.00E+3n/a<1.00E+4n/an/a7.530
MannKind Corporation
US Patent
Assay Description
A fusion protein comprising glutathione S transferase (GST) and human IRE-1α (GST-IRE-1α) obtained from a 500 ml baculovirus-infected ins...
US Patent US9693992 (2017)
BindingDB Entry DOI: 10.7270/Q2CZ35BC
Serine/threonine-protein kinase/endoribonuclease IRE1
(Homo sapiens (Human))
BDBM160342
(US9040714, 9 | US9693992, 9)
Show SMILES Cc1c(Br)c(=O)oc2c(C=O)c(O)c(F)cc12
Show InChI InChI=1S/C11H6BrFO4/c1-4-5-2-7(13)9(15)6(3-14)10(5)17-11(16)8(4)12/h2-3,15H,1H3
Reactome pathway
US Patent
n/an/a<1.00E+3n/an/an/an/a7.5n/a
MannKind Corporation
US Patent
Assay Description
A fusion protein comprising glutathione S transferase (GST) and human IRE-1alpha (GST-IRE-1alpha) obtained from a 500 ml baculovirus-infected insect ...
US Patent US9040714 (2015)
BindingDB Entry DOI: 10.7270/Q2S75F3S