BDBM16048 (4S)-4-amino-4-{[(1S)-1-{[(1S)-2-carbamoyl-1-{[(1R,3S,4S)-1-{[(1S)-1-carboxyethyl]carbamoyl}-3-hydroxy-1,6-dimethylheptan-4-yl]carbamoyl}ethyl]carbamoyl}-2-methylpropyl]carbamoyl}butanoic acid::truncated OM99-2 acyclic analog 2
SMILES: CC(C)C[C@H](NC(=O)[C@H](CC(N)=O)NC(=O)[C@@H](NC(=O)[C@@H](N)CCC(O)=O)C(C)C)[C@@H](O)C[C@@H](C)C(=O)N[C@@H](C)C(O)=O
InChI Key: InChIKey=BDWVJQLEYVUBNR-QHBRNMCNSA-N
Data: 2 IC50
PDB links: 1 PDB ID contains this monomer as substructures. 1 PDB ID contains inhibitors having a similarity of 90% to this monomer.
Activity Spreadsheet -- Enzyme Inhibition Constant Data from BindingDB
Found 2 hits for monomerid = 16048
Trg + Lig
Ki
nM
ΔG°
kcal/mole
IC50
nM
Kd
nM
EC50/IC50
nM
koff
s-1
kon
M-1s-1
pHTemp
°C
Cathepsin D
(Homo sapiens (Human))
BDBM16048
((4S)-4-amino-4-{[(1S)-1-{[(1S)-2-carbamoyl-1-{[(1R...)
Show SMILES CC(C)C[C@H](NC(=O)[C@H](CC(N)=O)NC(=O)[C@@H](NC(=O)[C@@H](N)CCC(O)=O)C(C)C)[C@@H](O)C[C@@H](C)C(=O)N[C@@H](C)C(O)=O |r|
Show InChI InChI=1S/C27H48N6O10/c1-12(2)9-17(19(34)10-14(5)23(38)30-15(6)27(42)43)31-25(40)18(11-20(29)35)32-26(41)22(13(3)4)33-24(39)16(28)7-8-21(36)37/h12-19,22,34H,7-11,28H2,1-6H3,(H2,29,35)(H,30,38)(H,31,40)(H,32,41)(H,33,39)(H,36,37)(H,42,43)/t14-,15+,16+,17+,18+,19+,22+/m1/s1
NCI pathway
Reactome pathway
n/an/a 98n/an/an/an/an/a25
Universite de Montreal at Succursale Centre-Ville
Assay Description
Inhibition assays were done in black 96-well plates by adding test compounds to the respective enzyme in assay buffer. Plates were incubated at room ...
J Med Chem 48: 5175-90 (2005)
Article DOI: 10.1021/jm050142+
BindingDB Entry DOI: 10.7270/Q2WM1BPC
beta-Secretase (BACE-1)
(Homo sapiens (Human))
BDBM16048
((4S)-4-amino-4-{[(1S)-1-{[(1S)-2-carbamoyl-1-{[(1R...)
Show SMILES CC(C)C[C@H](NC(=O)[C@H](CC(N)=O)NC(=O)[C@@H](NC(=O)[C@@H](N)CCC(O)=O)C(C)C)[C@@H](O)C[C@@H](C)C(=O)N[C@@H](C)C(O)=O |r|
Show InChI InChI=1S/C27H48N6O10/c1-12(2)9-17(19(34)10-14(5)23(38)30-15(6)27(42)43)31-25(40)18(11-20(29)35)32-26(41)22(13(3)4)33-24(39)16(28)7-8-21(36)37/h12-19,22,34H,7-11,28H2,1-6H3,(H2,29,35)(H,30,38)(H,31,40)(H,32,41)(H,33,39)(H,36,37)(H,42,43)/t14-,15+,16+,17+,18+,19+,22+/m1/s1
n/an/a 12n/an/an/an/a4.522
Universite de Montreal at Succursale Centre-Ville
Assay Description
Inhibition assays were done in black 96-well plates by adding test compounds to the respective enzyme in assay buffer. Plates were incubated at room ...
J Med Chem 48: 5175-90 (2005)
Article DOI: 10.1021/jm050142+
BindingDB Entry DOI: 10.7270/Q2WM1BPC