BDBM160484 US9682968, Example-27-3b (+)
SMILES: COC1CCN(Cc2c(cc(C)c3[nH]ccc23)C2CC2)C(C1)c1ccc(cc1)C(O)=O
InChI Key:
Data: 1 IC50
Activity Spreadsheet -- Enzyme Inhibition Constant Data from BindingDB
Found 1 hit for monomerid = 160484
Trg + Lig
Ki
nM
ΔG°
kcal/mole
IC50
nM
Kd
nM
EC50/IC50
nM
koff
s-1
kon
M-1s-1
pHTemp
°C
Complement factor B
(Homo sapiens (Human))
BDBM160484
(US9682968, Example-27-3b (+))
Show SMILES COC1CCN(Cc2c(cc(C)c3[nH]ccc23)C2CC2)C(C1)c1ccc(cc1)C(O)=O
US Patent
n/an/a 0.740n/an/an/an/an/an/a
Novartis AG
US Patent
Assay Description
CVF-Bb complex prepared from purified cobra venom factor (1 μM), recombinant human complement factor B (expressed in drosophila cells and purifi...
US Patent US9682968 (2017)
BindingDB Entry DOI: 10.7270/Q2XG9P9J