null
SMILES: Cc1cc(ccc1-c1ccccc1CNc1ccc(cc1)-c1ccc(Cl)cc1)C(=O)NCCC(O)=O
InChI Key: InChIKey=DBZWPDTZPGDXRT-UHFFFAOYSA-N
Activity Spreadsheet -- Enzyme Inhibition Constant Data from BindingDB
Found 1 hit for monomerid = 160575
Trg + Lig
Ki
nM
ΔG°
kcal/mole
IC50
nM
Kd
nM
EC50/IC50
nM
koff
s-1
kon
M-1s-1
pHTemp
°C
Pro-glucagon
(Homo sapiens (Human))
BDBM160575
(US9045389, 7)
Show SMILES Cc1cc(ccc1-c1ccccc1CNc1ccc(cc1)-c1ccc(Cl)cc1)C(=O)NCCC(O)=O
Show InChI InChI=1S/C30H27ClN2O3/c1-20-18-23(30(36)32-17-16-29(34)35)10-15-27(20)28-5-3-2-4-24(28)19-33-26-13-8-22(9-14-26)21-6-11-25(31)12-7-21/h2-15,18,33H,16-17,19H2,1H3,(H,32,36)(H,34,35)
Reactome pathway
US Patent
45 -9.31n/an/an/an/an/a7.44
Janssen Pharmaceutica NV
US Patent
Assay Description
Full-length human GCGR (Accession Number: NM000160) subcloned into pcDNA3.1 was stably transfected into HEK293 cells (hGluc-1 HEK) and maintained und...
US Patent US9045389 (2015)
BindingDB Entry DOI: 10.7270/Q2D21WC3