BDBM161154 US9051265, 62
SMILES: C[C@H](Oc1ccc(Cl)c(Cn2c(C)c(C)c3cc(ccc23)C(=O)N[C@@H](C)c2cccc(c2)C2CC2)c1)C(O)=O
InChI Key: InChIKey=BWSVTVVRQBRYCG-FPOVZHCZSA-N
Data: 1 IC50
Activity Spreadsheet -- Enzyme Inhibition Constant Data from BindingDB
Found 1 hit for monomerid = 161154
Trg + Lig
Ki
nM
ΔG°
kcal/mole
IC50
nM
Kd
nM
EC50/IC50
nM
koff
s-1
kon
M-1s-1
pHTemp
°C
Peroxisome proliferator-activated receptor
(Homo sapiens (Human))
BDBM161154
(US9051265, 62)
Show SMILES C[C@H](Oc1ccc(Cl)c(Cn2c(C)c(C)c3cc(ccc23)C(=O)N[C@@H](C)c2cccc(c2)C2CC2)c1)C(O)=O |r|
Show InChI InChI=1S/C32H33ClN2O4/c1-18-20(3)35(17-26-15-27(11-12-29(26)33)39-21(4)32(37)38)30-13-10-25(16-28(18)30)31(36)34-19(2)23-6-5-7-24(14-23)22-8-9-22/h5-7,10-16,19,21-22H,8-9,17H2,1-4H3,(H,34,36)(H,37,38)/t19-,21-/m0/s1
NCI pathway
Reactome pathway
US Patent
n/an/a 0.600n/an/an/an/an/an/a
The Scripps Research Institute
US Patent
Assay Description
The assay was performed according to manufacturer protocol. A mixture of 5 nM GST-PPARG-LBD, 5 nM Tb-GST-antibody, 5 nM Fluormone Pan- PPAR Green, an...
US Patent US9051265 (2015)
BindingDB Entry DOI: 10.7270/Q2FT8JSW