BDBM161294 US10738009, Compound 79::US10787472, Compound 5a::US9051270, 79::US9051270, 82::US9163042, 5a::US9758483, Compound 79
SMILES: FC(F)(F)Oc1ccc(Oc2cc(ccc2C(=O)Nc2cc[nH]c(=O)c2)C(F)(F)F)cc1
InChI Key: InChIKey=INIMUMMAVCNJFA-UHFFFAOYSA-N
Data: 6 IC50
Activity Spreadsheet -- Enzyme Inhibition Constant Data from BindingDB
Found 6 hits for monomerid = 161294
Trg + Lig
Ki
nM
ΔG°
kcal/mole
IC50
nM
Kd
nM
EC50/IC50
nM
koff
s-1
kon
M-1s-1
pHTemp
°C
Sodium channel protein type 10 subunit alpha
(Rattus norvegicus (Rat))
BDBM161294
(US10738009, Compound 79 | US10787472, Compound 5a ...)
Show SMILES FC(F)(F)Oc1ccc(Oc2cc(ccc2C(=O)Nc2cc[nH]c(=O)c2)C(F)(F)F)cc1
Show InChI InChI=1S/C20H12F6N2O4/c21-19(22,23)11-1-6-15(18(30)28-12-7-8-27-17(29)10-12)16(9-11)31-13-2-4-14(5-3-13)32-20(24,25)26/h1-10H,(H2,27,28,29,30)
US Patent
n/an/a 11n/an/an/an/an/an/a
VERTEX PHARMACEUTICALS INCORPORATED
US Patent
Assay Description
Patch clamp electrophysiology was used to assess the efficacy and selectivity of sodium channel blockers in dorsal root ganglion neurons. Rat neurons...
US Patent US9051270 (2015)
BindingDB Entry DOI: 10.7270/Q2B27T1F
Sodium channel protein type 10 subunit alpha
(Rattus norvegicus (Rat))
BDBM161294
(US10738009, Compound 79 | US10787472, Compound 5a ...)
Show SMILES FC(F)(F)Oc1ccc(Oc2cc(ccc2C(=O)Nc2cc[nH]c(=O)c2)C(F)(F)F)cc1
Show InChI InChI=1S/C20H12F6N2O4/c21-19(22,23)11-1-6-15(18(30)28-12-7-8-27-17(29)10-12)16(9-11)31-13-2-4-14(5-3-13)32-20(24,25)26/h1-10H,(H2,27,28,29,30)
US Patent
n/an/a 36n/an/an/an/an/an/a
VERTEX PHARMACEUTICALS INCORPORATED
US Patent
Assay Description
Patch clamp electrophysiology was used to assess the efficacy and selectivity of sodium channel blockers in dorsal root ganglion neurons. Rat neurons...
US Patent US9051270 (2015)
BindingDB Entry DOI: 10.7270/Q2B27T1F
Sodium channel protein type 10 subunit alpha
(Homo sapiens (Human))
BDBM161294
(US10738009, Compound 79 | US10787472, Compound 5a ...)
Show SMILES FC(F)(F)Oc1ccc(Oc2cc(ccc2C(=O)Nc2cc[nH]c(=O)c2)C(F)(F)F)cc1
Show InChI InChI=1S/C20H12F6N2O4/c21-19(22,23)11-1-6-15(18(30)28-12-7-8-27-17(29)10-12)16(9-11)31-13-2-4-14(5-3-13)32-20(24,25)26/h1-10H,(H2,27,28,29,30)
US Patent
n/an/a 11n/an/an/an/an/an/a
Vertex Pharmaceuticals Incorporated
US Patent
Assay Description
Patch clamp electrophysiology was used to assess the efficacy and selectivity of sodium channel blockers in dorsal root ganglion neurons. Rat neurons...
US Patent US10787472 (2020)
Sodium channel protein type 10 subunit alpha
(Homo sapiens (Human))
BDBM161294
(US10738009, Compound 79 | US10787472, Compound 5a ...)
Show SMILES FC(F)(F)Oc1ccc(Oc2cc(ccc2C(=O)Nc2cc[nH]c(=O)c2)C(F)(F)F)cc1
Show InChI InChI=1S/C20H12F6N2O4/c21-19(22,23)11-1-6-15(18(30)28-12-7-8-27-17(29)10-12)16(9-11)31-13-2-4-14(5-3-13)32-20(24,25)26/h1-10H,(H2,27,28,29,30)
US Patent
n/an/a 11n/an/an/an/an/an/a
VERTEX PHARMACEUTICALS INCORPORATED
US Patent
Assay Description
1) Pre-spotted compounds (in neat DMSO) into compound plates. Vehicle control (neat DMSO), the positive control (20 mM DMSO stock tetracaine, 125 ...
US Patent US9758483 (2017)
BindingDB Entry DOI: 10.7270/Q28C9ZCT
Sodium channel protein type 10 subunit alpha
(Homo sapiens (Human))
BDBM161294
(US10738009, Compound 79 | US10787472, Compound 5a ...)
Show SMILES FC(F)(F)Oc1ccc(Oc2cc(ccc2C(=O)Nc2cc[nH]c(=O)c2)C(F)(F)F)cc1
Show InChI InChI=1S/C20H12F6N2O4/c21-19(22,23)11-1-6-15(18(30)28-12-7-8-27-17(29)10-12)16(9-11)31-13-2-4-14(5-3-13)32-20(24,25)26/h1-10H,(H2,27,28,29,30)
US Patent
n/an/a 11n/an/an/an/an/an/a
VERTEX PHARMACEUTICALS INCORPORATED
US Patent
Assay Description
Patch clamp electrophysiology was used to assess the efficacy and selectivity of sodium channel blockers in dorsal root ganglion neurons. Rat neurons...
US Patent US10738009 (2020)
Sodium channel protein type 10 subunit alpha
(Rattus norvegicus (Rat))
BDBM161294
(US10738009, Compound 79 | US10787472, Compound 5a ...)
Show SMILES FC(F)(F)Oc1ccc(Oc2cc(ccc2C(=O)Nc2cc[nH]c(=O)c2)C(F)(F)F)cc1
Show InChI InChI=1S/C20H12F6N2O4/c21-19(22,23)11-1-6-15(18(30)28-12-7-8-27-17(29)10-12)16(9-11)31-13-2-4-14(5-3-13)32-20(24,25)26/h1-10H,(H2,27,28,29,30)
US Patent
n/an/a 11n/an/an/an/an/an/a
VERTEX PHARMACEUTICALS INCORPORATED
US Patent
Assay Description
Patch clamp electrophysiology was used to assess the efficacy and selectivity of sodium channel blockers in dorsal root ganglion neurons. Rat neurons...
US Patent US9163042 (2015)
BindingDB Entry DOI: 10.7270/Q21Z4361