BDBM161469 US9108978, 6.07
SMILES: O=C1N[C@H]2CS[C@@H](CCCCCc3cn(CCCCOc4ccc5ccccc5c4)nn3)[C@H]2N1
InChI Key: InChIKey=PLGWUMURZLHGNO-SDHOMARFSA-N
Data: 3 KI  1 IC50
Activity Spreadsheet -- Enzyme Inhibition Constant Data from BindingDB
Found 3 hits for monomerid = 161469
Trg + Lig
Ki
nM
ΔG°
kcal/mole
IC50
nM
Kd
nM
EC50/IC50
nM
koff
s-1
kon
M-1s-1
pHTemp
°C
Bifunctional ligase/repressor BirA
(Staphylococcus aureus)
BDBM161469
(US9108978, 6.07)
Show SMILES O=C1N[C@H]2CS[C@@H](CCCCCc3cn(CCCCOc4ccc5ccccc5c4)nn3)[C@H]2N1 |r|
Show InChI InChI=1S/C26H33N5O2S/c32-26-27-23-18-34-24(25(23)28-26)11-3-1-2-10-21-17-31(30-29-21)14-6-7-15-33-22-13-12-19-8-4-5-9-20(19)16-22/h4-5,8-9,12-13,16-17,23-25H,1-3,6-7,10-11,14-15,18H2,(H2,27,28,32)/t23-,24-,25-/m0/s1
US Patent
1.17E+3 -8.41 7.00E+3n/an/an/an/a8.037
Monash University; Adelaide Research & Innovation Pty Ltd
US Patent
Assay Description
Quantitation of BPL catalysed 3H-biotin incorporation into the biotin domain substrate was performed as previously described by Polyak et al, J. Biol...
US Patent US9108978 (2015)
BindingDB Entry DOI: 10.7270/Q2T43RVW
Bifunctional ligase/repressor BirA
(Escherichia coli)
BDBM161469
(US9108978, 6.07)
Show SMILES O=C1N[C@H]2CS[C@@H](CCCCCc3cn(CCCCOc4ccc5ccccc5c4)nn3)[C@H]2N1 |r|
Show InChI InChI=1S/C26H33N5O2S/c32-26-27-23-18-34-24(25(23)28-26)11-3-1-2-10-21-17-31(30-29-21)14-6-7-15-33-22-13-12-19-8-4-5-9-20(19)16-22/h4-5,8-9,12-13,16-17,23-25H,1-3,6-7,10-11,14-15,18H2,(H2,27,28,32)/t23-,24-,25-/m0/s1
US Patent
>3.00E+4>-6.41n/an/an/an/an/a8.037
Monash University; Adelaide Research & Innovation Pty Ltd
US Patent
Assay Description
Quantitation of BPL catalysed 3H-biotin incorporation into the biotin domain substrate was performed as previously described by Polyak et al, J. Biol...
US Patent US9108978 (2015)
BindingDB Entry DOI: 10.7270/Q2T43RVW
Bifunctional ligase/repressor BirA
(Escherichia coli)
BDBM161469
(US9108978, 6.07)
Show SMILES O=C1N[C@H]2CS[C@@H](CCCCCc3cn(CCCCOc4ccc5ccccc5c4)nn3)[C@H]2N1 |r|
Show InChI InChI=1S/C26H33N5O2S/c32-26-27-23-18-34-24(25(23)28-26)11-3-1-2-10-21-17-31(30-29-21)14-6-7-15-33-22-13-12-19-8-4-5-9-20(19)16-22/h4-5,8-9,12-13,16-17,23-25H,1-3,6-7,10-11,14-15,18H2,(H2,27,28,32)/t23-,24-,25-/m0/s1
US Patent
>3.00E+4>-6.41n/an/an/an/an/a8.037
Monash University; Adelaide Research & Innovation Pty Ltd
US Patent
Assay Description
Quantitation of BPL catalysed 3H-biotin incorporation into the biotin domain substrate was performed as previously described by Polyak et al, J. Biol...
US Patent US9108978 (2015)
BindingDB Entry DOI: 10.7270/Q2T43RVW