BDBM16180 (2S)-2-{[4-({[(2S)-1-cyclohexyl-3-(ethylsulfanyl)propan-2-yl]amino}methyl)-2-(2-methylphenyl)phenyl]formamido}-4-(methylsulfanyl)butanoic acid::A197574::CHEMBL344100::N-({5-[({(1S)-2-cyclohexyl-1-[(ethylsulfanyl)methyl]ethyl}amino)methyl]-2 -methylbiphenyl-2-yl}carbonyl)-L-methionine
SMILES: CCSC[C@H](CC1CCCCC1)NCc1ccc(C(=O)N[C@@H](CCSC)C(O)=O)c(c1)-c1ccccc1C
InChI Key: InChIKey=SAVLZOMOKUOGAK-SVEHJYQDSA-N
Data: 2 IC50
Activity Spreadsheet -- Enzyme Inhibition Constant Data from BindingDB
Found 2 hits for monomerid = 16180
Trg + Lig
Ki
nM
ΔG°
kcal/mole
IC50
nM
Kd
nM
EC50/IC50
nM
koff
s-1
kon
M-1s-1
pHTemp
°C
Protein Farnesyltransferase (PFT)/farnesyltransferase beta subunit
(Rattus norvegicus-Rattus norvegicus (rat))
BDBM16180
((2S)-2-{[4-({[(2S)-1-cyclohexyl-3-(ethylsulfanyl)p...)
Show SMILES CCSC[C@H](CC1CCCCC1)NCc1ccc(C(=O)N[C@@H](CCSC)C(O)=O)c(c1)-c1ccccc1C |r|
Show InChI InChI=1S/C31H44N2O3S2/c1-4-38-21-25(18-23-11-6-5-7-12-23)32-20-24-14-15-27(28(19-24)26-13-9-8-10-22(26)2)30(34)33-29(31(35)36)16-17-37-3/h8-10,13-15,19,23,25,29,32H,4-7,11-12,16-18,20-21H2,1-3H3,(H,33,34)(H,35,36)/t25-,29-/m0/s1
n/an/a 0.200n/an/an/an/an/an/a
Abbott Laboratories
Curated by ChEMBL
Assay Description
In vitro inhibitory activity against Farnesyltransferase (FTase)
J Med Chem 42: 4844-52 (1999)
BindingDB Entry DOI: 10.7270/Q2WW7GWR
Protein Farnesyltransferase (PFT)
(Plasmodium falciparum (malaria parasite P. falcipa...)
BDBM16180
((2S)-2-{[4-({[(2S)-1-cyclohexyl-3-(ethylsulfanyl)p...)
Show SMILES CCSC[C@H](CC1CCCCC1)NCc1ccc(C(=O)N[C@@H](CCSC)C(O)=O)c(c1)-c1ccccc1C |r|
Show InChI InChI=1S/C31H44N2O3S2/c1-4-38-21-25(18-23-11-6-5-7-12-23)32-20-24-14-15-27(28(19-24)26-13-9-8-10-22(26)2)30(34)33-29(31(35)36)16-17-37-3/h8-10,13-15,19,23,25,29,32H,4-7,11-12,16-18,20-21H2,1-3H3,(H,33,34)(H,35,36)/t25-,29-/m0/s1
n/an/a 5n/an/an/an/an/an/a
University of Washington at Seattle
Assay Description
Assays for PFT activity were performed with a PFT-specific scintillation assay (SPA) kit (Amersham Biosciences, Piscataway, NJ). IC50 values were cal...
J Med Chem 48: 3704-13 (2005)
Article DOI: 10.1021/jm0491039
BindingDB Entry DOI: 10.7270/Q2BC3WSQ