BDBM161950 US9682991, 9
SMILES: CN1CCOc2c1c(NCc1ccc(F)cc1)nn1c(nnc21)-c1cccc(OC(F)(F)F)c1
InChI Key: InChIKey=MAAOVTKGNCPPBD-UHFFFAOYSA-N
Data: 2 IC50
Activity Spreadsheet -- Enzyme Inhibition Constant Data from BindingDB
Found 2 hits for monomerid = 161950
Trg + Lig
Ki
nM
ΔG°
kcal/mole
IC50
nM
Kd
nM
EC50/IC50
nM
koff
s-1
kon
M-1s-1
pHTemp
°C
Serine/threonine-protein kinase pim-2
(Homo sapiens (Human))
BDBM161950
(US9682991, 9)
Show SMILES CN1CCOc2c1c(NCc1ccc(F)cc1)nn1c(nnc21)-c1cccc(OC(F)(F)F)c1
Show InChI InChI=1S/C22H18F4N6O2/c1-31-9-10-33-18-17(31)19(27-12-13-5-7-15(23)8-6-13)30-32-20(28-29-21(18)32)14-3-2-4-16(11-14)34-22(24,25)26/h2-8,11H,9-10,12H2,1H3,(H,27,30)
US Patent
n/an/a>1.00E+3n/an/an/an/an/an/a
FUNDACIÓN CENTRO NACIONAL DE INVESTIGACIONES ONCOLOGICAS CARLOS III
US Patent
Assay Description
The biochemical assay to measure PIM-2 activity relies on the ADP Hunter assay kit (DiscoveRx Corp., Cat. #90-0077), that determines the amount of AD...
US Patent US9682991 (2017)
BindingDB Entry DOI: 10.7270/Q2513WCB
Serine/threonine-protein kinase pim-1
(Homo sapiens (Human))
BDBM161950
(US9682991, 9)
Show SMILES CN1CCOc2c1c(NCc1ccc(F)cc1)nn1c(nnc21)-c1cccc(OC(F)(F)F)c1
Show InChI InChI=1S/C22H18F4N6O2/c1-31-9-10-33-18-17(31)19(27-12-13-5-7-15(23)8-6-13)30-32-20(28-29-21(18)32)14-3-2-4-16(11-14)34-22(24,25)26/h2-8,11H,9-10,12H2,1H3,(H,27,30)
US Patent
n/an/a 52n/an/an/an/an/an/a
FUNDACIÓN CENTRO NACIONAL DE INVESTIGACIONES ONCOLOGICAS CARLOS III
US Patent
Assay Description
The biochemical assay to measure PIM-1 activity relies on the ADP Hunter assay kit (DiscoveRx Corp., Cat. #90-0077), that determines the amount of AD...
US Patent US9682991 (2017)
BindingDB Entry DOI: 10.7270/Q2513WCB