BDBM162003 US9682991, 57
SMILES: CN1CCOc2c(nn3c(nnc3c12)-c1cccc(OC(F)(F)F)c1)N1CCC(CN)CC1
InChI Key: InChIKey=QCMXYHOELKPBMD-UHFFFAOYSA-N
Data: 3 IC50
Activity Spreadsheet -- Enzyme Inhibition Constant Data from BindingDB
Found 3 hits for monomerid = 162003
Trg + Lig
Ki
nM
ΔG°
kcal/mole
IC50
nM
Kd
nM
EC50/IC50
nM
koff
s-1
kon
M-1s-1
pHTemp
°C
Serine/threonine-protein kinase pim-1
(Homo sapiens (Human))
BDBM162003
(US9682991, 57)
Show SMILES CN1CCOc2c(nn3c(nnc3c12)-c1cccc(OC(F)(F)F)c1)N1CCC(CN)CC1
Show InChI InChI=1S/C21H24F3N7O2/c1-29-9-10-32-17-16(29)19-27-26-18(14-3-2-4-15(11-14)33-21(22,23)24)31(19)28-20(17)30-7-5-13(12-25)6-8-30/h2-4,11,13H,5-10,12,25H2,1H3
US Patent
n/an/a<100n/an/an/an/an/an/a
FUNDACIÓN CENTRO NACIONAL DE INVESTIGACIONES ONCOLOGICAS CARLOS III
US Patent
Assay Description
The biochemical assay to measure PIM-1 activity relies on the ADP Hunter assay kit (DiscoveRx Corp., Cat. #90-0077), that determines the amount of AD...
US Patent US9682991 (2017)
BindingDB Entry DOI: 10.7270/Q2513WCB
Serine/threonine-protein kinase pim-3
(Homo sapiens (Human))
BDBM162003
(US9682991, 57)
Show SMILES CN1CCOc2c(nn3c(nnc3c12)-c1cccc(OC(F)(F)F)c1)N1CCC(CN)CC1
Show InChI InChI=1S/C21H24F3N7O2/c1-29-9-10-32-17-16(29)19-27-26-18(14-3-2-4-15(11-14)33-21(22,23)24)31(19)28-20(17)30-7-5-13(12-25)6-8-30/h2-4,11,13H,5-10,12,25H2,1H3
US Patent
n/an/a>1.00E+3n/an/an/an/an/an/a
FUNDACIÓN CENTRO NACIONAL DE INVESTIGACIONES ONCOLOGICAS CARLOS III
US Patent
Assay Description
The biochemical assay to measure PIM-3 activity relies on the ADP Hunter assay kit (DiscoveRx Corp., Cat. #90-0077), that determines the amount of AD...
US Patent US9682991 (2017)
BindingDB Entry DOI: 10.7270/Q2513WCB
Serine/threonine-protein kinase pim-2
(Homo sapiens (Human))
BDBM162003
(US9682991, 57)
Show SMILES CN1CCOc2c(nn3c(nnc3c12)-c1cccc(OC(F)(F)F)c1)N1CCC(CN)CC1
Show InChI InChI=1S/C21H24F3N7O2/c1-29-9-10-32-17-16(29)19-27-26-18(14-3-2-4-15(11-14)33-21(22,23)24)31(19)28-20(17)30-7-5-13(12-25)6-8-30/h2-4,11,13H,5-10,12,25H2,1H3
US Patent
n/an/a>1.00E+3n/an/an/an/an/an/a
FUNDACIÓN CENTRO NACIONAL DE INVESTIGACIONES ONCOLOGICAS CARLOS III
US Patent
Assay Description
The biochemical assay to measure PIM-2 activity relies on the ADP Hunter assay kit (DiscoveRx Corp., Cat. #90-0077), that determines the amount of AD...
US Patent US9682991 (2017)
BindingDB Entry DOI: 10.7270/Q2513WCB