BDBM162037 US9682991, 93
SMILES: CN1CCOc2c1c(NCC1CCN(CC1)C(C)=O)nn1c(nnc21)-c1cccc(OC(F)(F)F)c1
InChI Key: InChIKey=WPJTVPXVNXYLHF-UHFFFAOYSA-N
Data: 2 IC50
Activity Spreadsheet -- Enzyme Inhibition Constant Data from BindingDB
Found 2 hits for monomerid = 162037
Trg + Lig
Ki
nM
ΔG°
kcal/mole
IC50
nM
Kd
nM
EC50/IC50
nM
koff
s-1
kon
M-1s-1
pHTemp
°C
Serine/threonine-protein kinase pim-3
(Homo sapiens (Human))
BDBM162037
(US9682991, 93)
Show SMILES CN1CCOc2c1c(NCC1CCN(CC1)C(C)=O)nn1c(nnc21)-c1cccc(OC(F)(F)F)c1
Show InChI InChI=1S/C23H26F3N7O3/c1-14(34)32-8-6-15(7-9-32)13-27-20-18-19(35-11-10-31(18)2)22-29-28-21(33(22)30-20)16-4-3-5-17(12-16)36-23(24,25)26/h3-5,12,15H,6-11,13H2,1-2H3,(H,27,30)
US Patent
n/an/a<100n/an/an/an/an/an/a
FUNDACIÓN CENTRO NACIONAL DE INVESTIGACIONES ONCOLOGICAS CARLOS III
US Patent
Assay Description
The biochemical assay to measure PIM-3 activity relies on the ADP Hunter assay kit (DiscoveRx Corp., Cat. #90-0077), that determines the amount of AD...
US Patent US9682991 (2017)
BindingDB Entry DOI: 10.7270/Q2513WCB
Serine/threonine-protein kinase pim-1
(Homo sapiens (Human))
BDBM162037
(US9682991, 93)
Show SMILES CN1CCOc2c1c(NCC1CCN(CC1)C(C)=O)nn1c(nnc21)-c1cccc(OC(F)(F)F)c1
Show InChI InChI=1S/C23H26F3N7O3/c1-14(34)32-8-6-15(7-9-32)13-27-20-18-19(35-11-10-31(18)2)22-29-28-21(33(22)30-20)16-4-3-5-17(12-16)36-23(24,25)26/h3-5,12,15H,6-11,13H2,1-2H3,(H,27,30)
US Patent
n/an/a<100n/an/an/an/an/an/a
FUNDACIÓN CENTRO NACIONAL DE INVESTIGACIONES ONCOLOGICAS CARLOS III
US Patent
Assay Description
The biochemical assay to measure PIM-1 activity relies on the ADP Hunter assay kit (DiscoveRx Corp., Cat. #90-0077), that determines the amount of AD...
US Patent US9682991 (2017)
BindingDB Entry DOI: 10.7270/Q2513WCB