BDBM162048 US9682991, 102
SMILES: FC(F)(F)Oc1cccc(c1)-c1nnc2c3OCCOc3c(NCC3CC3)nn12
InChI Key: InChIKey=QLMGRMHMGRXLKC-UHFFFAOYSA-N
Data: 2 IC50
Activity Spreadsheet -- Enzyme Inhibition Constant Data from BindingDB
Found 2 hits for monomerid = 162048
Trg + Lig
Ki
nM
ΔG°
kcal/mole
IC50
nM
Kd
nM
EC50/IC50
nM
koff
s-1
kon
M-1s-1
pHTemp
°C
Serine/threonine-protein kinase pim-2
(Homo sapiens (Human))
BDBM162048
(US9682991, 102)
Show SMILES FC(F)(F)Oc1cccc(c1)-c1nnc2c3OCCOc3c(NCC3CC3)nn12
Show InChI InChI=1S/C18H16F3N5O3/c19-18(20,21)29-12-3-1-2-11(8-12)16-23-24-17-14-13(27-6-7-28-14)15(25-26(16)17)22-9-10-4-5-10/h1-3,8,10H,4-7,9H2,(H,22,25)
US Patent
n/an/a<100n/an/an/an/an/an/a
FUNDACIÓN CENTRO NACIONAL DE INVESTIGACIONES ONCOLOGICAS CARLOS III
US Patent
Assay Description
The biochemical assay to measure PIM-2 activity relies on the ADP Hunter assay kit (DiscoveRx Corp., Cat. #90-0077), that determines the amount of AD...
US Patent US9682991 (2017)
BindingDB Entry DOI: 10.7270/Q2513WCB
Serine/threonine-protein kinase pim-1
(Homo sapiens (Human))
BDBM162048
(US9682991, 102)
Show SMILES FC(F)(F)Oc1cccc(c1)-c1nnc2c3OCCOc3c(NCC3CC3)nn12
Show InChI InChI=1S/C18H16F3N5O3/c19-18(20,21)29-12-3-1-2-11(8-12)16-23-24-17-14-13(27-6-7-28-14)15(25-26(16)17)22-9-10-4-5-10/h1-3,8,10H,4-7,9H2,(H,22,25)
US Patent
n/an/a<100n/an/an/an/an/an/a
FUNDACIÓN CENTRO NACIONAL DE INVESTIGACIONES ONCOLOGICAS CARLOS III
US Patent
Assay Description
The biochemical assay to measure PIM-1 activity relies on the ADP Hunter assay kit (DiscoveRx Corp., Cat. #90-0077), that determines the amount of AD...
US Patent US9682991 (2017)
BindingDB Entry DOI: 10.7270/Q2513WCB