BDBM162049 US9682991, 103
SMILES:
InChI Key: InChIKey=KHQOQUSRQDIGCV-UHFFFAOYSA-N
Data: 2 IC50
Activity Spreadsheet -- Enzyme Inhibition Constant Data from BindingDB
Found 2 hits for monomerid = 162049
Trg + Lig
Ki
nM
ΔG°
kcal/mole
IC50
nM
Kd
nM
EC50/IC50
nM
koff
s-1
kon
M-1s-1
pHTemp
°C
Serine/threonine-protein kinase pim-2
(Homo sapiens (Human))
BDBM162049
(US9682991, 103)
Show InChI InChI=1S/C21H24F3N7O3/c1-29-8-11-33-17-16(29)18(25-14-6-9-31(2,32)10-7-14)28-30-19(26-27-20(17)30)13-4-3-5-15(12-13)34-21(22,23)24/h3-5,12,14H,6-11H2,1-2H3,(H,25,28)
US Patent
n/an/a>1.00E+3n/an/an/an/an/an/a
FUNDACIÓN CENTRO NACIONAL DE INVESTIGACIONES ONCOLOGICAS CARLOS III
US Patent
Assay Description
The biochemical assay to measure PIM-2 activity relies on the ADP Hunter assay kit (DiscoveRx Corp., Cat. #90-0077), that determines the amount of AD...
US Patent US9682991 (2017)
BindingDB Entry DOI: 10.7270/Q2513WCB
Serine/threonine-protein kinase pim-1
(Homo sapiens (Human))
BDBM162049
(US9682991, 103)
Show InChI InChI=1S/C21H24F3N7O3/c1-29-8-11-33-17-16(29)18(25-14-6-9-31(2,32)10-7-14)28-30-19(26-27-20(17)30)13-4-3-5-15(12-13)34-21(22,23)24/h3-5,12,14H,6-11H2,1-2H3,(H,25,28)
US Patent
n/an/a<100n/an/an/an/an/an/a
FUNDACIÓN CENTRO NACIONAL DE INVESTIGACIONES ONCOLOGICAS CARLOS III
US Patent
Assay Description
The biochemical assay to measure PIM-1 activity relies on the ADP Hunter assay kit (DiscoveRx Corp., Cat. #90-0077), that determines the amount of AD...
US Patent US9682991 (2017)
BindingDB Entry DOI: 10.7270/Q2513WCB