BDBM162069 US9051279, 79
SMILES: COc1cc2CC(=O)N([C@@H](c3ccc(Cl)cc3)c2cc1OC(C)C)c1ccc(cc1)N(C)C[C@H]1CC[C@@H](CC1)N1CCNC(=O)C1
InChI Key: InChIKey=BZZYIHQWCXHSMZ-FMSKOOSDSA-N
Data: 4 IC50
Activity Spreadsheet -- Enzyme Inhibition Constant Data from BindingDB
Found 4 hits for monomerid = 162069
Trg + Lig
Ki
nM
ΔG°
kcal/mole
IC50
nM
Kd
nM
EC50/IC50
nM
koff
s-1
kon
M-1s-1
pHTemp
°C
E3 ubiquitin-protein ligase Mdm2
(Homo sapiens (Human))
BDBM162069
(US9051279, 79)
Show SMILES COc1cc2CC(=O)N([C@@H](c3ccc(Cl)cc3)c2cc1OC(C)C)c1ccc(cc1)N(C)C[C@H]1CC[C@@H](CC1)N1CCNC(=O)C1 |r,wU:36.43,wD:9.9,33.36,(6,3.85,;6,2.31,;4.67,1.54,;3.33,2.31,;2,1.54,;.67,2.31,;-.67,1.54,;-2,2.31,;-.67,,;.67,-.77,;.67,-2.31,;-.67,-3.08,;-.67,-4.62,;.67,-5.39,;.67,-6.93,;2,-4.62,;2,-3.08,;2,,;3.33,-.77,;4.67,,;6,-.77,;7.34,,;8.67,-.77,;7.34,1.54,;-2,-.77,;-3.33,,;-4.67,-.77,;-4.67,-2.31,;-3.33,-3.08,;-2,-2.31,;-6,-3.08,;-6,-4.62,;-7.34,-2.31,;-7.34,-.77,;-6,,;-6,1.54,;-7.34,2.31,;-8.67,1.54,;-8.67,,;-7.34,3.85,;-8.67,4.62,;-8.67,6.16,;-7.34,6.93,;-6,6.16,;-4.67,6.93,;-6,4.62,)|
Show InChI InChI=1S/C37H45ClN4O4/c1-24(2)46-34-21-32-27(19-33(34)45-4)20-36(44)42(37(32)26-7-9-28(38)10-8-26)31-15-13-29(14-16-31)40(3)22-25-5-11-30(12-6-25)41-18-17-39-35(43)23-41/h7-10,13-16,19,21,24-25,30,37H,5-6,11-12,17-18,20,22-23H2,1-4H3,(H,39,43)/t25-,30-,37-/m0/s1
NCI pathway
Reactome pathway
US Patent
n/an/a 1.60n/an/an/an/an/an/a
Novartis AG
US Patent
Assay Description
The inhibition of p53-Hdm2 and p53-Hdm4 interactions is measured by time resolved fluorescence energy transfer (TR-FRET). Fluorescence energy transfe...
US Patent US9051279 (2015)
BindingDB Entry DOI: 10.7270/Q2DV1HMM
Cytochrome P450 3A4
(Homo sapiens (Human))
BDBM162069
(US9051279, 79)
Show SMILES COc1cc2CC(=O)N([C@@H](c3ccc(Cl)cc3)c2cc1OC(C)C)c1ccc(cc1)N(C)C[C@H]1CC[C@@H](CC1)N1CCNC(=O)C1 |r,wU:36.43,wD:9.9,33.36,(6,3.85,;6,2.31,;4.67,1.54,;3.33,2.31,;2,1.54,;.67,2.31,;-.67,1.54,;-2,2.31,;-.67,,;.67,-.77,;.67,-2.31,;-.67,-3.08,;-.67,-4.62,;.67,-5.39,;.67,-6.93,;2,-4.62,;2,-3.08,;2,,;3.33,-.77,;4.67,,;6,-.77,;7.34,,;8.67,-.77,;7.34,1.54,;-2,-.77,;-3.33,,;-4.67,-.77,;-4.67,-2.31,;-3.33,-3.08,;-2,-2.31,;-6,-3.08,;-6,-4.62,;-7.34,-2.31,;-7.34,-.77,;-6,,;-6,1.54,;-7.34,2.31,;-8.67,1.54,;-8.67,,;-7.34,3.85,;-8.67,4.62,;-8.67,6.16,;-7.34,6.93,;-6,6.16,;-4.67,6.93,;-6,4.62,)|
Show InChI InChI=1S/C37H45ClN4O4/c1-24(2)46-34-21-32-27(19-33(34)45-4)20-36(44)42(37(32)26-7-9-28(38)10-8-26)31-15-13-29(14-16-31)40(3)22-25-5-11-30(12-6-25)41-18-17-39-35(43)23-41/h7-10,13-16,19,21,24-25,30,37H,5-6,11-12,17-18,20,22-23H2,1-4H3,(H,39,43)/t25-,30-,37-/m0/s1
Reactome pathway
n/an/a 1.13E+4n/an/an/an/an/an/a
Novartis Institutes for BioMedical Research
Curated by ChEMBL
Assay Description
Time dependent inhibition of CYP3A4 in human liver microsomes
J Med Chem 58: 6348-58 (2015)
BindingDB Entry DOI: 10.7270/Q2HQ41QV
Potassium voltage-gated channel subfamily H member 2
(Homo sapiens (Human))
BDBM162069
(US9051279, 79)
Show SMILES COc1cc2CC(=O)N([C@@H](c3ccc(Cl)cc3)c2cc1OC(C)C)c1ccc(cc1)N(C)C[C@H]1CC[C@@H](CC1)N1CCNC(=O)C1 |r,wU:36.43,wD:9.9,33.36,(6,3.85,;6,2.31,;4.67,1.54,;3.33,2.31,;2,1.54,;.67,2.31,;-.67,1.54,;-2,2.31,;-.67,,;.67,-.77,;.67,-2.31,;-.67,-3.08,;-.67,-4.62,;.67,-5.39,;.67,-6.93,;2,-4.62,;2,-3.08,;2,,;3.33,-.77,;4.67,,;6,-.77,;7.34,,;8.67,-.77,;7.34,1.54,;-2,-.77,;-3.33,,;-4.67,-.77,;-4.67,-2.31,;-3.33,-3.08,;-2,-2.31,;-6,-3.08,;-6,-4.62,;-7.34,-2.31,;-7.34,-.77,;-6,,;-6,1.54,;-7.34,2.31,;-8.67,1.54,;-8.67,,;-7.34,3.85,;-8.67,4.62,;-8.67,6.16,;-7.34,6.93,;-6,6.16,;-4.67,6.93,;-6,4.62,)|
Show InChI InChI=1S/C37H45ClN4O4/c1-24(2)46-34-21-32-27(19-33(34)45-4)20-36(44)42(37(32)26-7-9-28(38)10-8-26)31-15-13-29(14-16-31)40(3)22-25-5-11-30(12-6-25)41-18-17-39-35(43)23-41/h7-10,13-16,19,21,24-25,30,37H,5-6,11-12,17-18,20,22-23H2,1-4H3,(H,39,43)/t25-,30-,37-/m0/s1
Reactome pathway
n/an/a 1.60E+4n/an/an/an/an/an/a
Novartis Institutes for BioMedical Research
Curated by ChEMBL
Assay Description
Inhibition of human ERG by radioligand binding assay
J Med Chem 58: 6348-58 (2015)
BindingDB Entry DOI: 10.7270/Q2HQ41QV
Protein Mdm4
(Homo sapiens (Human))
BDBM162069
(US9051279, 79)
Show SMILES COc1cc2CC(=O)N([C@@H](c3ccc(Cl)cc3)c2cc1OC(C)C)c1ccc(cc1)N(C)C[C@H]1CC[C@@H](CC1)N1CCNC(=O)C1 |r,wU:36.43,wD:9.9,33.36,(6,3.85,;6,2.31,;4.67,1.54,;3.33,2.31,;2,1.54,;.67,2.31,;-.67,1.54,;-2,2.31,;-.67,,;.67,-.77,;.67,-2.31,;-.67,-3.08,;-.67,-4.62,;.67,-5.39,;.67,-6.93,;2,-4.62,;2,-3.08,;2,,;3.33,-.77,;4.67,,;6,-.77,;7.34,,;8.67,-.77,;7.34,1.54,;-2,-.77,;-3.33,,;-4.67,-.77,;-4.67,-2.31,;-3.33,-3.08,;-2,-2.31,;-6,-3.08,;-6,-4.62,;-7.34,-2.31,;-7.34,-.77,;-6,,;-6,1.54,;-7.34,2.31,;-8.67,1.54,;-8.67,,;-7.34,3.85,;-8.67,4.62,;-8.67,6.16,;-7.34,6.93,;-6,6.16,;-4.67,6.93,;-6,4.62,)|
Show InChI InChI=1S/C37H45ClN4O4/c1-24(2)46-34-21-32-27(19-33(34)45-4)20-36(44)42(37(32)26-7-9-28(38)10-8-26)31-15-13-29(14-16-31)40(3)22-25-5-11-30(12-6-25)41-18-17-39-35(43)23-41/h7-10,13-16,19,21,24-25,30,37H,5-6,11-12,17-18,20,22-23H2,1-4H3,(H,39,43)/t25-,30-,37-/m0/s1
NCI pathway
US Patent
n/an/a 1.66E+3n/an/an/an/an/an/a
Novartis AG
US Patent
Assay Description
The inhibition of p53-Hdm2 and p53-Hdm4 interactions is measured by time resolved fluorescence energy transfer (TR-FRET). Fluorescence energy transfe...
US Patent US9051279 (2015)
BindingDB Entry DOI: 10.7270/Q2DV1HMM