BDBM162188 US9682995, 87
SMILES: COc1ccc2nc(Nc3snc(C)c3C(=O)Nc3ccc(OC)nc3)sc2c1
InChI Key: InChIKey=XKTBNFZXIJQENE-UHFFFAOYSA-N
Data: 2 IC50
Activity Spreadsheet -- Enzyme Inhibition Constant Data from BindingDB
Found 2 hits for monomerid = 162188
Trg + Lig
Ki
nM
ΔG°
kcal/mole
IC50
nM
Kd
nM
EC50/IC50
nM
koff
s-1
kon
M-1s-1
pHTemp
°C
Mitotic checkpoint serine/threonine-protein kinase BUB1 (aa 704-1085)
(Homo sapiens (Human))
BDBM162188
(US9682995, 87)
Show SMILES COc1ccc2nc(Nc3snc(C)c3C(=O)Nc3ccc(OC)nc3)sc2c1
Show InChI InChI=1S/C19H17N5O3S2/c1-10-16(17(25)21-11-4-7-15(27-3)20-9-11)18(29-24-10)23-19-22-13-6-5-12(26-2)8-14(13)28-19/h4-9H,1-3H3,(H,21,25)(H,22,23)
US Patent
n/an/a 1.50E+4n/an/an/an/a8.0n/a
BAYER PHARMA AKTIENGESELLSCHAFT
US Patent
Assay Description
Recombinant fusion proteins of GST and human CDK2 and of GST and human CycE, expressed in insect cells (Sf9) and purified by Glutathion-Sepharose aff...
US Patent US9682995 (2017)
BindingDB Entry DOI: 10.7270/Q2WH2N5Q
CDK2/CycE
(Homo sapiens (Human))
BDBM162188
(US9682995, 87)
Show SMILES COc1ccc2nc(Nc3snc(C)c3C(=O)Nc3ccc(OC)nc3)sc2c1
Show InChI InChI=1S/C19H17N5O3S2/c1-10-16(17(25)21-11-4-7-15(27-3)20-9-11)18(29-24-10)23-19-22-13-6-5-12(26-2)8-14(13)28-19/h4-9H,1-3H3,(H,21,25)(H,22,23)
US Patent
n/an/a>2.00E+4n/an/an/an/a7.522
BAYER PHARMA AKTIENGESELLSCHAFT
US Patent
Assay Description
N-terminally His6-tagged recombinant catalytic domain of human Bub1 (amino acids 704-1085), expressed in insect cells (Hi5) and purified by Ni-NTA af...
US Patent US9682995 (2017)
BindingDB Entry DOI: 10.7270/Q2WH2N5Q