BDBM16257 1-N-[(2,5-dimethyl-1,3-oxazol-4-yl)methyl]-3-N-[(1R,3S,4S)-3-hydroxy-1,6-dimethyl-1-{[(1S)-2-methyl-1-(propan-2-ylcarbamoyl)propyl]carbamoyl}heptan-4-yl]-5-(N-methylmethanesulfonamido)benzene-1,3-dicarboxamide::Isophthalamide Derivative 5b
SMILES: CC(C)C[C@H](NC(=O)c1cc(cc(c1)C(=O)NCc1nc(C)oc1C)N(C)S(C)(=O)=O)[C@@H](O)C[C@@H](C)C(=O)N[C@@H](C(C)C)C(=O)NC(C)C
InChI Key: InChIKey=HVXRCOUKAWTMKX-CXVOGFMYSA-N
Data: 3 KI
Activity Spreadsheet -- Enzyme Inhibition Constant Data from BindingDB
Found 3 hits for monomerid = 16257
Trg + Lig
Ki
nM
ΔG°
kcal/mole
IC50
nM
Kd
nM
EC50/IC50
nM
koff
s-1
kon
M-1s-1
pHTemp
°C
Beta-secretase 1
(Homo sapiens (Human))
BDBM16257
(1-N-[(2,5-dimethyl-1,3-oxazol-4-yl)methyl]-3-N-[(1...)
Show SMILES CC(C)C[C@H](NC(=O)c1cc(cc(c1)C(=O)NCc1nc(C)oc1C)N(C)S(C)(=O)=O)[C@@H](O)C[C@@H](C)C(=O)N[C@@H](C(C)C)C(=O)NC(C)C |r|
Show InChI InChI=1S/C34H54N6O8S/c1-18(2)12-27(29(41)13-21(7)31(42)39-30(19(3)4)34(45)36-20(5)6)38-33(44)25-14-24(15-26(16-25)40(10)49(11,46)47)32(43)35-17-28-22(8)48-23(9)37-28/h14-16,18-21,27,29-30,41H,12-13,17H2,1-11H3,(H,35,43)(H,36,45)(H,38,44)(H,39,42)/t21-,27+,29+,30+/m1/s1
1.80 -12.4n/an/an/an/an/a4.537
Purdue University
Assay Description
Enzyme activities were assayed by monitoring the hydrolysis of substrate in the presence or absence of inhibitor compounds. The hydrolysis was record...
J Med Chem 50: 2399-407 (2007)
Article DOI: 10.1021/jm061338s
BindingDB Entry DOI: 10.7270/Q2348HNP
Cathepsin D
(Homo sapiens (Human))
BDBM16257
(1-N-[(2,5-dimethyl-1,3-oxazol-4-yl)methyl]-3-N-[(1...)
Show SMILES CC(C)C[C@H](NC(=O)c1cc(cc(c1)C(=O)NCc1nc(C)oc1C)N(C)S(C)(=O)=O)[C@@H](O)C[C@@H](C)C(=O)N[C@@H](C(C)C)C(=O)NC(C)C |r|
Show InChI InChI=1S/C34H54N6O8S/c1-18(2)12-27(29(41)13-21(7)31(42)39-30(19(3)4)34(45)36-20(5)6)38-33(44)25-14-24(15-26(16-25)40(10)49(11,46)47)32(43)35-17-28-22(8)48-23(9)37-28/h14-16,18-21,27,29-30,41H,12-13,17H2,1-11H3,(H,35,43)(H,36,45)(H,38,44)(H,39,42)/t21-,27+,29+,30+/m1/s1
NCI pathway
Reactome pathway
245 -9.38n/an/an/an/an/a4.537
Purdue University
Assay Description
Enzyme activities were assayed by monitoring the hydrolysis of substrate in the presence or absence of inhibitor compounds. The hydrolysis was record...
J Med Chem 50: 2399-407 (2007)
Article DOI: 10.1021/jm061338s
BindingDB Entry DOI: 10.7270/Q2348HNP
Beta-secretase 2
(Homo sapiens (Human))
BDBM16257
(1-N-[(2,5-dimethyl-1,3-oxazol-4-yl)methyl]-3-N-[(1...)
Show SMILES CC(C)C[C@H](NC(=O)c1cc(cc(c1)C(=O)NCc1nc(C)oc1C)N(C)S(C)(=O)=O)[C@@H](O)C[C@@H](C)C(=O)N[C@@H](C(C)C)C(=O)NC(C)C |r|
Show InChI InChI=1S/C34H54N6O8S/c1-18(2)12-27(29(41)13-21(7)31(42)39-30(19(3)4)34(45)36-20(5)6)38-33(44)25-14-24(15-26(16-25)40(10)49(11,46)47)32(43)35-17-28-22(8)48-23(9)37-28/h14-16,18-21,27,29-30,41H,12-13,17H2,1-11H3,(H,35,43)(H,36,45)(H,38,44)(H,39,42)/t21-,27+,29+,30+/m1/s1
556 -8.87n/an/an/an/an/a4.537
Purdue University
Assay Description
Enzyme activities were assayed by monitoring the hydrolysis of substrate in the presence or absence of inhibitor compounds. The hydrolysis was record...
J Med Chem 50: 2399-407 (2007)
Article DOI: 10.1021/jm061338s
BindingDB Entry DOI: 10.7270/Q2348HNP