BDBM16259 1-N-[(1R,3S,4S)-3-hydroxy-1,6-dimethyl-1-{[(1S)-2-methyl-1-(propan-2-ylcarbamoyl)propyl]carbamoyl}heptan-4-yl]-5-(N-methylmethanesulfonamido)-3-N-[(1R)-1-phenylethyl]benzene-1,3-dicarboxamide::GRL-7234::Isophthalamide Derivative 5d
SMILES: CC(C)C[C@H](NC(=O)c1cc(cc(c1)C(=O)N[C@H](C)c1ccccc1)N(C)S(C)(=O)=O)[C@@H](O)C[C@@H](C)C(=O)N[C@@H](C(C)C)C(=O)NC(C)C
InChI Key: InChIKey=BJOCXJJVELLFKM-LLWRDSBASA-N
Data: 3 KI
PDB links: 1 PDB ID matches this monomer.
Activity Spreadsheet -- Enzyme Inhibition Constant Data from BindingDB
Found 3 hits for monomerid = 16259
Trg + Lig
Ki
nM
ΔG°
kcal/mole
IC50
nM
Kd
nM
EC50/IC50
nM
koff
s-1
kon
M-1s-1
pHTemp
°C
Beta-secretase 1
(Homo sapiens (Human))
BDBM16259
(1-N-[(1R,3S,4S)-3-hydroxy-1,6-dimethyl-1-{[(1S)-2-...)
Show SMILES CC(C)C[C@H](NC(=O)c1cc(cc(c1)C(=O)N[C@H](C)c1ccccc1)N(C)S(C)(=O)=O)[C@@H](O)C[C@@H](C)C(=O)N[C@@H](C(C)C)C(=O)NC(C)C |r|
Show InChI InChI=1S/C36H55N5O7S/c1-21(2)16-30(31(42)17-24(7)33(43)40-32(22(3)4)36(46)37-23(5)6)39-35(45)28-18-27(19-29(20-28)41(9)49(10,47)48)34(44)38-25(8)26-14-12-11-13-15-26/h11-15,18-25,30-32,42H,16-17H2,1-10H3,(H,37,46)(H,38,44)(H,39,45)(H,40,43)/t24-,25-,30+,31+,32+/m1/s1
1.10 -12.7n/an/an/an/an/a4.537
Purdue University
Assay Description
Enzyme activities were assayed by monitoring the hydrolysis of substrate in the presence or absence of inhibitor compounds. The hydrolysis was record...
J Med Chem 50: 2399-407 (2007)
Article DOI: 10.1021/jm061338s
BindingDB Entry DOI: 10.7270/Q2348HNP
3D
3D Structure (crystal)
Beta-secretase 2
(Homo sapiens (Human))
BDBM16259
(1-N-[(1R,3S,4S)-3-hydroxy-1,6-dimethyl-1-{[(1S)-2-...)
Show SMILES CC(C)C[C@H](NC(=O)c1cc(cc(c1)C(=O)N[C@H](C)c1ccccc1)N(C)S(C)(=O)=O)[C@@H](O)C[C@@H](C)C(=O)N[C@@H](C(C)C)C(=O)NC(C)C |r|
Show InChI InChI=1S/C36H55N5O7S/c1-21(2)16-30(31(42)17-24(7)33(43)40-32(22(3)4)36(46)37-23(5)6)39-35(45)28-18-27(19-29(20-28)41(9)49(10,47)48)34(44)38-25(8)26-14-12-11-13-15-26/h11-15,18-25,30-32,42H,16-17H2,1-10H3,(H,37,46)(H,38,44)(H,39,45)(H,40,43)/t24-,25-,30+,31+,32+/m1/s1
31 -10.6n/an/an/an/an/a4.537
Purdue University
Assay Description
Enzyme activities were assayed by monitoring the hydrolysis of substrate in the presence or absence of inhibitor compounds. The hydrolysis was record...
J Med Chem 50: 2399-407 (2007)
Article DOI: 10.1021/jm061338s
BindingDB Entry DOI: 10.7270/Q2348HNP
Cathepsin D
(Homo sapiens (Human))
BDBM16259
(1-N-[(1R,3S,4S)-3-hydroxy-1,6-dimethyl-1-{[(1S)-2-...)
Show SMILES CC(C)C[C@H](NC(=O)c1cc(cc(c1)C(=O)N[C@H](C)c1ccccc1)N(C)S(C)(=O)=O)[C@@H](O)C[C@@H](C)C(=O)N[C@@H](C(C)C)C(=O)NC(C)C |r|
Show InChI InChI=1S/C36H55N5O7S/c1-21(2)16-30(31(42)17-24(7)33(43)40-32(22(3)4)36(46)37-23(5)6)39-35(45)28-18-27(19-29(20-28)41(9)49(10,47)48)34(44)38-25(8)26-14-12-11-13-15-26/h11-15,18-25,30-32,42H,16-17H2,1-10H3,(H,37,46)(H,38,44)(H,39,45)(H,40,43)/t24-,25-,30+,31+,32+/m1/s1
NCI pathway
Reactome pathway
41 -10.5n/an/an/an/an/a4.537
Purdue University
Assay Description
Enzyme activities were assayed by monitoring the hydrolysis of substrate in the presence or absence of inhibitor compounds. The hydrolysis was record...
J Med Chem 50: 2399-407 (2007)
Article DOI: 10.1021/jm061338s
BindingDB Entry DOI: 10.7270/Q2348HNP