BDBM16287 3-N-[(1R,3S,4S)-3-amino-1-{[(1S)-1-(benzylcarbamoyl)-2-methylpropyl]carbamoyl}-1,6-dimethylheptan-4-yl]-1-N,1-N-dipropylbenzene-1,3-dicarboxamide::Aminoethylene (AE) compound 2::N -[(1S,2S,4R)-2-amino-5-{[(1S)-1-(benzylcarbamoyl)-2-methylpropyl]amino}-4-methyl-1-(2-methylpropyl)-5-oxopentyl]-N,N-dipropylbenzene-1,3-dicarboxamide
SMILES: CCCN(CCC)C(=O)c1cccc(c1)C(=O)N[C@@H](CC(C)C)[C@@H](N)C[C@@H](C)C(=O)N[C@@H](C(C)C)C(=O)NCc1ccccc1
InChI Key: InChIKey=FCHFJDXLCKNCCS-IOUGBZEOSA-N
Data: 1 KI
Activity Spreadsheet -- Enzyme Inhibition Constant Data from BindingDB
Found 1 hit for monomerid = 16287
Trg + Lig
Ki
nM
ΔG°
kcal/mole
IC50
nM
Kd
nM
EC50/IC50
nM
koff
s-1
kon
M-1s-1
pHTemp
°C
beta-Secretase (BACE-1)
(Homo sapiens (Human))
BDBM16287
(3-N-[(1R,3S,4S)-3-amino-1-{[(1S)-1-(benzylcarbamoy...)
Show SMILES CCCN(CCC)C(=O)c1cccc(c1)C(=O)N[C@@H](CC(C)C)[C@@H](N)C[C@@H](C)C(=O)N[C@@H](C(C)C)C(=O)NCc1ccccc1 |r|
Show InChI InChI=1S/C36H55N5O4/c1-8-18-41(19-9-2)36(45)29-17-13-16-28(22-29)34(43)39-31(20-24(3)4)30(37)21-26(7)33(42)40-32(25(5)6)35(44)38-23-27-14-11-10-12-15-27/h10-17,22,24-26,30-32H,8-9,18-21,23,37H2,1-7H3,(H,38,44)(H,39,43)(H,40,42)/t26-,30+,31+,32+/m1/s1
120 -9.34n/an/an/an/an/a4.522
Sunesis
Assay Description
Compounds were tested for their ability to inhibit BACE-1 hydrolysis of the internally quenched fluorescent substrate FS-2. Reactions were initiated ...
J Med Chem 49: 839-42 (2006)
Article DOI: 10.1021/jm0509142
BindingDB Entry DOI: 10.7270/Q2PV6HM0